program: Gaussian 09
title: 000086666
version: EM64L-G09RevD.01
frameworkgroup: C1[X(C5H7IO2)]
method: RPBEPBE
basis: SDD
operation: Freq
keyword: #pfreq=noraman
keyword: PBEPBE/SDD
title: #p freq=noraman PBEPBE/SDD
converged: YES YES NO NO
title: Mulliken charges:
elementType: I O O C C C C C H H H H H H H
charge: 0.087289 -0.210888 -0.194035 0.005170 -0.592193 -0.519705 -0.683406 0.232717 0.281469 0.310862 0.267433 0.304295 0.226234 0.225552 0.259206
chargesum: 0.00000
title: Mulliken charges with hydrogens summed into heavy atoms:
elementType: I O O C C C C C
charge: 0.087289 -0.210888 -0.194035 0.286640 -0.281331 0.052022 0.027587 0.232717
polarizability: 9.92679527e+01 -3.34594844e+00 7.54702640e+01 -8.54678088e+00 -1.00612571e-01 5.73495922e+01
1716.lowfreq: -17.5064 -7.7622 -0.0006 -0.0004 -0.0004 5.1381 58.1077 105.9459 169.2062
frequency: 57.9601 105.7628 169.2016 215.5417 254.0481 260.0053 404.2387 466.7694 500.2475 580.4907 635.1612 700.8944 775.4518 836.7526 895.6767 930.2108 1007.5405 1015.9720 1069.3320 1099.4925 1110.2342 1138.5717 1188.6999 1219.7592 1281.8529 1301.5721 1318.6231 1387.2052 1433.0629 1460.3909 1472.0292 1716.4840 2991.5656 3002.6778 3077.9437 3096.7663 3105.8869 3112.7189 3118.3233
redmass: 7.6590 4.7613 4.5082 1.0952 3.2625 2.8080 4.1709 5.3450 2.4957 3.8190 6.1217 4.1079 5.2249 2.9037 3.0186 2.2306 1.8609 2.1875 3.1545 2.3068 1.6989 1.2483 1.2474 1.6977 1.4058 1.4483 1.3028 1.2078 1.0761 1.0503 1.0475 12.6450 1.0361 1.0682 1.0937 1.0956 1.0982 1.0897 1.0941
irintensity: 4.8220 0.1874 1.4001 0.1943 1.8814 6.8535 10.1035 3.0916 7.1474 7.9588 3.3677 2.9719 17.5071 26.7595 37.0509 36.9522 13.5225 32.6970 137.5125 44.1587 56.8274 18.4802 45.6164 8.7324 6.5043 7.8180 3.6361 18.3472 25.8915 13.7522 11.9165 360.5992 12.0672 4.8695 2.4342 23.0627 15.7519 8.0136 0.0753
temp: 298.150 k
press: 1.00000 atm
elementType: 53 8 8 6 6 6 6 6 1 1 1 1 1 1 1
symmnumber: 1
zpe: 296166.2 jmol-1
zpe.correction: 0.112804 hartree
zpe.thermalcorrener: 0.121003 hartree
zpe.thermalcorrenthalpy: 0.121948 hartree
zpe.thermalcorrgfe: 0.077730 hartree
zpe.sumelectzpe: -356.066496 hartree
zpe.sumelectthermal: -356.058297 hartree
zpe.sumelectthermalent: -356.057353 hartree
zpe.sumelectthermalfe: -356.101570 hartree
dipole: 0.9523 4.0001 2.9649
dipole: 5.0694
quadrupole: -70.2651 -63.9617 -60.8084
quadrupole: -10.9395 -6.8470 -2.1337
quadrupole: -5.2534 1.0500 4.2033 -10.9395 -6.8470 -2.1337
hfenergy: -356.1793001 hartree
pointgroup: C01 [X(C5H7I1O2)]
dipole: -1.3662582 -0.8795272 1.1565399 debye
dipolederiv: -0.2202503 0.15959 -0.0743258 0.1814304 -0.3116121 0.0876048 -0.107106 0.1133745 -0.1305442 -0.9298067 -0.3449428 -0.042095 -0.532755 -0.7900122 -0.1635611 -0.2847303 -0.3211313 -0.4849511 -1.1811761 -0.2809896 0.0236041 -0.2673295 -0.4813945 -0.0640506 0.1540957 -0.0702147 -0.3997297 0.6161366 0.2324894 -0.0057217 0.1329145 0.3411159 -0.0402856 -0.2955063 0.0547959 0.1981193 0.2831772 -0.342163 0.1834667 -0.3443966 0.4574399 -0.2863666 0.3422235 -0.3226619 0.1540489 -0.2234484 0.0243632 0.1289526 0.1054494 -0.105608 -0.0871995 0.0495373 -0.1025014 -0.246993 -0.043276 0.0584888 -0.0007993 0.0171227 -0.1713778 0.0798172 0.1153997 -0.0490281 0.0338689 1.6520511 0.4305432 -0.0835878 0.7187449 0.8475242 0.3547327 0.0659694 0.5762121 0.6977894 -0.0196726 -0.0413608 -0.0571535 -0.0149642 0.0511567 0.0217552 -0.0555437 0.0035138 -0.0149558 -0.0483318 0.0638211 -0.0086515 0.0206883 -0.0338071 0.1163065 0.0397765 0.0923356 -0.0149598 -0.0109553 0.0701915 -0.0601895 0.025179 0.0855995 0.1035711 -0.0298629 0.0687553 0.022221 0.1060616 -0.012259 0.0095123 -0.0189019 0.0015036 -0.044668 0.0108631 -0.0263088 0.1332921 0.034547 -0.002189 -0.1091689 -0.0457216 0.0935708 -0.0406396 -0.100355 0.0158547 -0.062 -0.1132929 -0.0786115 0.0490264 -0.0527927 0.0654875 0.0135542 0.0571313 0.0445404 0.0933417 0.0982365 0.0630286 0.0471309 0.0753322 -0.0495864 -0.0505708 0.0381077 -0.0775361 0.0214522 unknown
polarizability: 85.3512389|-11.0777786|86.9239338|9.7238308|-8.7941173|59.8126362 unknown
InChI: InChI=1S/C5H7IO2/c1-3-4(6)2-5(7)8-3/h3-4H,2H2,1H3
charge 0 multiplicity 1
15 atoms
I  -2.177015 1.858972 -0.446916
O  0.667762 -0.607024 -0.886759
O  2.457193 0.706008 -0.189249
C  -0.709635 -0.931796 -0.397596
C  -1.063025 0.218961 0.586585
C  0.302698 0.711212 1.088486
C  -0.697182 -2.309207 0.283674
C  1.291999 0.324114 -0.02188
H  -1.347098 -0.942574 -1.294367
H  -1.759651 -0.094525 1.376359
H  0.594794 0.176602 2.014194
H  0.362626 1.788406 1.296786
H  -0.088507 -2.306587 1.205496
H  -1.727002 -2.616748 0.540652
H  -0.271757 -3.057614 -0.405367
