program: Gaussian 09
title: 000086665
version: EM64L-G09RevD.01
frameworkgroup: C1[X(C6H14Cl2Si)]
method: RPBEPBE
basis: SDD
operation: Freq
keyword: #p
keyword: freq=noraman
keyword: PBEPBE/SDD
title: #p freq=noraman PBEPBE/SDD
converged: YES YES NO NO
title: Mulliken charges:
elementType: Cl Cl Si C C C C C C H H H H H H H H H H H H H H
charge: -0.335361 -0.084336 1.063216 -0.780994 -0.017562 -0.993525 -1.005565 -0.605249 -0.679607 0.259485 0.254198 0.217072 0.256750 0.240661 0.259565 0.255787 0.233066 0.261617 0.266914 0.267875 0.217482 0.210878 0.237632
chargesum: 0.00000
title: Mulliken charges with hydrogens summed into heavy atoms:
elementType: Cl Cl Si C C C C C C
charge: -0.335361 -0.084336 1.063216 -0.267311 0.199510 -0.236549 -0.255095 -0.070460 -0.013615
polarizability: 1.17542419e+02 -1.94581351e+00 1.00991529e+02 -3.39447981e+00 -2.64108763e+00 9.68582930e+01
1716.lowfreq: -12.5686 -5.0985 -0.0018 0.0006 0.0025 3.5095 41.8089 50.7937 71.7793
frequency: 41.7562 50.4243 71.7399 113.2619 136.4075 148.7952 152.5974 167.7355 177.5359 202.7149 215.3209 232.7018 252.7036 327.6924 382.6046 430.4433 497.0438 603.7512 644.7601 713.1233 742.1163 752.9289 815.3249 816.1584 859.6699 885.6497 892.4924 921.8511 960.2629 1019.4648 1060.7674 1088.1738 1171.7174 1210.6174 1230.0606 1266.0536 1304.4984 1313.2750 1318.1029 1327.8473 1394.1602 1432.3047 1436.0895 1440.3862 1443.4921 1445.6127 1454.1149 1476.4991 1482.6240 2933.7194 2982.2852 2986.1676 2986.6648 2988.9489 3042.6540 3049.7288 3073.0002 3087.2866 3088.3249 3091.7988 3103.0825 3104.0824 3126.3334
redmass: 4.3676 3.5912 5.3583 3.6189 1.0250 1.4227 1.9864 3.1855 3.2411 2.9907 3.1305 1.2270 2.3246 2.5229 2.3971 5.2746 3.8499 4.4229 4.1181 2.9562 1.9839 1.8132 1.3531 2.5051 1.5383 1.4821 1.5070 1.5557 1.7896 1.4157 1.7178 1.2741 1.3355 1.4506 1.2665 1.3557 1.2062 1.2069 1.4500 1.3823 1.1998 1.0864 1.0527 1.0842 1.0629 1.0478 1.0489 1.0502 1.0512 1.0815 1.0373 1.0572 1.0351 1.0348 1.0580 1.0987 1.0991 1.0981 1.0989 1.0978 1.0989 1.0987 1.1115
irintensity: 1.7429 1.5489 0.9203 2.2588 0.0041 0.3611 0.1766 2.4612 1.3308 1.2295 8.7952 0.3631 3.3137 3.1219 4.7110 44.9005 9.1472 13.5532 28.9673 11.0816 10.0989 1.8441 4.7247 30.8940 33.4601 131.3493 19.7438 105.0895 1.2677 11.2088 15.1488 9.3634 23.2464 1.1486 13.7679 11.5894 51.3667 22.2407 8.3260 17.9150 21.2008 2.7440 1.7096 3.7436 7.6487 10.0392 14.0656 12.6582 13.7843 16.9524 25.0199 3.4017 7.9135 8.9684 25.9508 11.2320 55.9091 13.1273 13.9254 13.8510 5.4677 11.5970 16.2665
temp: 298.150 k
press: 1.00000 atm
elementType: 17 17 14 6 6 6 6 6 6 1 1 1 1 1 1 1 1 1 1 1 1 1 1
symmnumber: 1
zpe: 491482.8 jmol-1
zpe.correction: 0.187196 hartree
zpe.thermalcorrener: 0.200942 hartree
zpe.thermalcorrenthalpy: 0.201886 hartree
zpe.thermalcorrgfe: 0.145741 hartree
zpe.sumelectzpe: -1445.861127 hartree
zpe.sumelectthermal: -1445.847381 hartree
zpe.sumelectthermalent: -1445.846437 hartree
zpe.sumelectthermalfe: -1445.902582 hartree
dipole: -1.0052 3.8128 -1.2404
dipole: 4.1336
quadrupole: -92.0007 -80.9316 -74.8185
quadrupole: 3.4020 5.8952 -0.1052
quadrupole: -9.4171 1.6520 7.7651 3.4020 5.8952 -0.1052
hfenergy: -1446.0483228 hartree
pointgroup: C01 [X(C6H14Cl2Si1)]
dipole: 0.3702357 -1.3405117 -0.8430565 debye
dipolederiv: -0.6081832 0.1989007 0.0180426 0.2331578 -0.6849606 -0.0220474 0.0155183 -0.0143911 -0.4035102 -0.3789697 -0.0776114 -0.1225031 -0.0841843 -0.221902 -0.0592077 -0.2190687 -0.0969622 -0.4132022 1.6092244 -0.195114 -0.0173279 -0.2057222 1.4335982 0.0072715 -0.0290747 0.0054177 1.2241409 -0.4186764 0.0123134 0.0407565 0.0596585 -0.3118667 -0.0130101 0.0712848 -0.0108807 -0.2374572 0.0492795 -0.0093497 -0.0105158 -0.2276968 0.1149127 0.0182827 -0.2251932 -0.0402914 0.040859 -0.3915515 -0.0202099 0.0365106 -0.0554995 -0.342687 0.0651105 0.0410621 0.0625029 -0.4197557 -0.4100507 -0.0234534 -0.0424638 -0.0616278 -0.3334842 -0.0649735 -0.0478501 -0.0551225 -0.4369623 0.3461606 0.1048158 0.234267 0.1892818 0.184552 0.1128588 0.342921 0.1397451 0.5365227 0.0307202 -0.0106642 0.0027776 0.0447641 -0.0696539 0.0695626 0.0296658 0.048074 0.0299677 0.0635027 -0.0158618 -0.0987107 0.0136637 0.0781758 -0.0389375 -0.0079942 -0.0442794 -0.0406267 0.0625061 -0.037075 0.0588228 0.0209428 -0.0868731 0.0711209 0.0172976 0.0850696 0.0272419 0.0123881 -0.0289173 -0.0916485 -0.0196101 0.0299444 -0.0385161 0.0002736 -0.007916 -0.1330325 -0.1039789 -0.0574977 0.0201924 -0.0779395 0.0895812 0.0056283 0.0542466 0.0150782 0.1065895 0.0733037 0.0911389 -0.013695 0.1274778 -0.083625 0.011812 -0.0507241 0.0410379 0.0982967 0.104727 -0.019135 -0.0368291 -0.0019453 0.0742536 -0.0608024 -0.0459663 -0.0835479 -0.0651656 0.1160137 -0.0146786 0.0340164 -0.003524 0.0571834 0.0744849 0.0445224 0.0990346 -0.0611458 0.0710472 0.0966328 0.028341 0.1317704 -0.0735112 -0.0278257 0.0627161 -0.0616155 0.0852958 -0.1035414 -0.0598425 -0.0167689 -0.076462 0.0919572 -0.0018765 -0.0471682 -0.0106056 0.1169807 -0.1015995 0.0436959 0.0191853 0.0807189 0.0274178 -0.1005496 0.0123506 -0.0727165 -0.040261 0.0721441 0.0029006 -0.071813 -0.0444379 -0.0740783 0.0681123 -0.0550425 0.0500626 -0.0431728 -0.0674145 0.1454759 0.0708551 0.1068578 -0.0027985 -0.0246017 0.0865215 -0.0646586 0.0430457 -0.1367207 -0.1323715 -0.0157273 -0.1334154 0.0254333 0.0109994 -0.0267189 0.0061525 0.0765983 0.1096694 0.0059082 -0.0257644 -0.0162289 0.0784312 -0.0628955 -0.0235796 0.0108122 -0.0912469 unknown
polarizability: 116.8199638|-3.8867875|99.7312581|3.941266|2.9622583|98.8410194 unknown
InChI: InChI=1S/C6H14Cl2Si/c1-6(4-7)5-9(2,3)8/h6H,4-5H2,1-3H3
charge 0 multiplicity 1
23 atoms
Cl -2.868489 1.858631 0.165846
Cl 3.36375 0.755226 0.974052
Si -1.61192 0.013068 0.040272
C  0.191565 0.658022 0.003602
C  1.242923 -0.299411 -0.624651
C  -2.065029 -0.988076 1.590066
C  -2.125479 -0.845014 -1.577288
C  2.62065 0.374348 -0.733072
C  1.330982 -1.665764 0.095348
H  0.498305 0.913056 1.037057
H  0.179218 1.612441 -0.559757
H  0.951697 -0.487496 -1.683835
H  -3.143879 -1.223233 1.59675
H  -1.501053 -1.938135 1.633484
H  -1.837646 -0.410065 2.502792
H  -1.952179 -0.185819 -2.44591
H  -1.55501 -1.780762 -1.72987
H  -3.199751 -1.098729 -1.553671
H  3.365423 -0.276489 -1.217966
H  2.569868 1.352309 -1.236573
H  2.126662 -2.295635 -0.343141
H  0.381253 -2.225439 0.012857
H  1.559839 -1.526135 1.166606
