program: Gaussian 09
title: 000086769
version: EM64L-G09RevD.01
frameworkgroup: C1[X(C20H22N2O5)]
method: RPBEPBE
basis: SDD
operation: Freq
keyword: #p
keyword: freq=noraman
keyword: PBEPBE/SDD
title: #p freq=noraman PBEPBE/SDD
converged: YES YES NO NO
title: Mulliken charges:
elementType: O O O O O N N C C C C C C C C C C C C C C C C C C C C H H H H H H H H H H H H H H H H H H H H H H
charge: -0.339809 -0.266627 -0.419612 -0.214947 -0.243639 -0.397265 -0.620481 0.192037 0.470092 -0.718464 -0.763569 -0.414819 -0.378073 0.357203 -0.415047 -0.415326 -0.119901 0.336455 0.336088 -0.572228 0.161582 -0.395892 -0.400538 0.267259 -0.237136 -0.236741 -0.243457 0.224962 0.220515 0.238018 0.278347 0.235161 0.207559 0.237138 0.244893 0.236265 0.235121 0.324895 0.314064 0.212763 0.284523 0.244417 0.237941 0.224325 0.223352 0.227625 0.315415 0.340436 0.385118
chargesum: 0.00000
title: Mulliken charges with hydrogens summed into heavy atoms:
elementType: O O O O O N N C C C C C C C C C C C C C C C C C C C C
charge: -0.339809 -0.266627 -0.034494 -0.214947 -0.243639 -0.083200 0.035369 0.192037 0.470092 -0.034969 -0.042501 -0.177680 -0.133179 0.357203 -0.178782 -0.180206 0.204994 0.336455 0.336088 -0.074941 0.161582 -0.151475 -0.162597 0.267259 -0.012811 -0.013389 -0.015832
polarizability: 3.23267316e+02 -4.07434403e+01 2.58458572e+02 -2.58795936e+01 -1.08532414e+01 1.77010314e+02
1716.lowfreq: -5.0777 -3.0982 -0.0006 -0.0004 0.0001 3.8848 12.4278 15.5019 19.8324
frequency: 12.2104 15.0880 19.7418 33.8758 38.5907 43.2703 52.2743 69.4917 70.6951 76.7115 89.2885 102.9338 131.7181 142.9110 181.9648 204.9145 221.4838 224.1834 234.5950 242.6540 269.6049 276.9282 299.7008 316.9806 337.3757 344.1726 384.8707 395.9986 403.8210 409.2095 422.1171 441.2550 463.7358 480.8763 504.0722 516.5735 526.6191 538.9533 561.7827 570.0208 579.9249 592.4203 614.2237 627.1251 638.0480 661.9585 675.3380 682.3431 702.2470 705.4798 710.1503 741.4765 755.2181 772.7235 802.9295 838.0392 841.0035 848.1107 850.4888 882.5504 908.4659 917.7045 922.7437 931.4516 959.4698 973.4572 973.9488 980.6003 988.3382 992.7025 996.2381 1007.1255 1017.5445 1035.6432 1040.4639 1052.0140 1083.1319 1083.2471 1101.0051 1125.3392 1136.7468 1158.3024 1172.4215 1181.3800 1191.1028 1203.9281 1208.4902 1220.2031 1259.8044 1273.4048 1287.0086 1289.6178 1292.0600 1304.8388 1316.0840 1352.2963 1355.5574 1369.8460 1374.1715 1376.9215 1393.9291 1413.2179 1437.1116 1442.6526 1455.6941 1464.1474 1474.7355 1476.2184 1478.3770 1491.3469 1516.4136 1566.0193 1588.1252 1601.6658 1612.7790 1624.0512 1652.8221 1661.0142 1673.4386 2992.4307 2992.9006 2998.0721 3026.1259 3064.4614 3086.6700 3097.5795 3101.7077 3120.8104 3122.0651 3124.9182 3127.5718 3130.2660 3139.4296 3147.3888 3149.6905 3158.4296 3163.6828 3517.8826 3520.1070 3567.6732 3673.3142
redmass: 6.8120 6.8605 3.9381 4.7694 6.8230 10.8545 6.1865 4.6855 5.3401 5.2491 4.9420 6.1501 4.2311 3.9073 4.1590 2.0099 4.8972 6.5260 1.4965 3.1041 3.8920 1.1840 4.7666 3.9247 3.4923 3.0647 3.5571 3.9680 2.8676 2.8944 3.3115 4.2246 4.3139 1.3742 1.4876 3.2469 2.3103 2.0082 2.6861 2.9815 2.7455 1.4587 6.4388 2.5125 6.3050 2.7535 3.9834 3.1997 1.7441 5.9013 9.0291 2.8863 6.1473 2.0714 4.0686 4.1002 1.4522 1.4037 1.2493 2.2913 4.4603 1.6183 1.9183 1.6000 1.3761 1.3909 1.4543 4.1854 4.7296 1.3267 5.5906 1.4777 2.7032 2.9484 1.9457 2.0581 1.7193 2.2247 1.9429 1.6420 2.0374 2.1637 1.0527 1.8612 1.1163 1.3269 1.9223 1.8961 1.6967 3.0991 1.5405 1.8623 3.1314 1.4078 1.3583 1.5290 2.8583 2.5130 7.0651 1.2685 1.2163 3.6712 2.3677 1.1246 1.0662 1.0581 1.1353 1.7183 1.8800 1.0686 2.7996 6.1453 6.5209 1.3841 6.0561 6.3266 3.9780 9.5433 9.1345 1.0626 1.0350 1.0365 1.0818 1.0988 1.0989 1.1002 1.1002 1.0844 1.1003 1.0873 1.0870 1.0877 1.0919 1.0964 1.0956 1.0957 1.1016 1.0449 1.0643 1.0773 1.1042
irintensity: 0.8050 0.7934 0.0853 3.7535 9.7149 0.9949 2.6715 0.6121 4.9365 3.4393 0.9834 3.2494 5.6775 0.7779 4.2053 2.5430 4.3128 4.4646 1.1265 0.6512 0.8180 0.3993 3.9172 7.6291 4.4713 4.3737 0.4538 10.9727 0.3097 0.8607 8.2679 3.7166 23.1483 60.7624 97.7291 24.7012 11.3156 97.7153 66.5872 31.4151 8.7548 138.7578 0.0545 22.5813 2.5513 49.6207 13.4271 32.7452 44.9487 14.4418 34.9288 32.8091 5.9803 52.4068 28.3742 1.2265 23.9395 19.1755 0.3085 1.5197 38.8486 4.5621 3.7275 0.5507 0.0842 0.6645 0.7930 341.0186 0.3364 0.1840 10.7997 38.0469 3.2517 62.4857 8.0277 76.4987 6.2807 19.3503 91.7258 12.2725 248.9859 6.8175 0.0730 60.4048 0.2682 2.5962 21.2652 80.1987 33.1854 82.7447 12.7051 97.0765 0.9382 2.9157 1.4036 74.8905 1.3347 110.5965 0.5952 29.6836 25.2725 10.5939 1.6177 84.7968 8.4216 3.2105 10.7479 179.9473 141.5231 46.6161 3.5194 2.3088 1.3363 60.0394 10.7845 0.9434 218.8531 312.2921 194.8726 23.4087 16.7780 26.5092 13.5775 6.5558 13.2966 58.4022 20.0735 8.5763 9.9668 2.7860 11.8212 11.2102 13.8531 18.5222 41.0801 10.8538 26.3059 34.1528 26.8786 30.3184 24.1030
temp: 298.150 k
press: 1.00000 atm
elementType: 8 8 8 8 8 7 7 6 6 6 6 6 6 6 6 6 6 6 6 6 6 6 6 6 6 6 6 1 1 1 1 1 1 1 1 1 1 1 1 1 1 1 1 1 1 1 1 1 1
symmnumber: 1
zpe: 1014773.1 jmol-1
zpe.correction: 0.386507 hartree
zpe.thermalcorrener: 0.413072 hartree
zpe.thermalcorrenthalpy: 0.414016 hartree
zpe.thermalcorrgfe: 0.325324 hartree
zpe.sumelectzpe: -1259.032527 hartree
zpe.sumelectthermal: -1259.005962 hartree
zpe.sumelectthermalent: -1259.005018 hartree
zpe.sumelectthermalfe: -1259.093709 hartree
dipole: -3.6252 -1.2888 4.2659
dipole: 5.7446
quadrupole: -124.0616 -143.9007 -149.5523
quadrupole: 17.2697 -12.6753 -13.3020
quadrupole: 15.1100 -4.7292 -10.3808 17.2697 -12.6753 -13.3020
hfenergy: -1259.4190335 hartree
pointgroup: C01 [X(C20H22N2O5)]
dipole: -1.4842374 -0.5227981 1.6222843 debye
polarizability: 325.5439632|-39.7791895|257.9888924|-20.4135896|-12.223753|175.2033465 unknown
InChI: InChI=1S/C20H22N2O5/c1-20(2,27-19(26)22-16(18(24)25)12-17(21)23)15-10-8-14(9-11-15)13-6-4-3-5-7-13/h3-11,16,22,24H,12,21H2,1-2H3
charge 0 multiplicity 1
49 atoms
O  -1.800139 1.741202 0.888399
O  -1.660478 0.831124 -1.30289
O  -5.537582 -0.943047 -2.425683
O  -5.415781 1.08752 -1.299614
O  -2.33362 -3.159652 -0.062563
N  -3.249332 0.120688 0.269484
N  -3.620568 -3.560677 1.825778
C  -0.622064 2.679417 0.680505
C  0.649336 1.852597 0.436907
C  -0.543546 3.390544 2.049218
C  -0.970343 3.679507 -0.438774
C  1.659363 2.27443 -0.460186
C  0.86993 0.664017 1.179182
C  3.071543 0.337728 0.121525
C  2.848553 1.532448 -0.613186
C  2.052276 -0.081233 1.02031
C  -3.917355 -0.797524 -0.639926
C  -2.183789 0.895762 -0.164762
C  4.322698 -0.454807 -0.049626
C  -4.504026 -2.018063 0.108805
C  -5.014265 -0.082838 -1.450381
C  4.306802 -1.874572 0.042035
C  5.566178 0.185235 -0.310784
C  -3.381653 -2.944616 0.608205
C  5.490022 -2.626392 -0.119654
C  6.750025 -0.565274 -0.47467
C  6.719062 -1.976143 -0.378967
H  -1.475292 3.94951 2.244527
H  0.306143 4.095221 2.054016
H  -0.390816 2.657791 2.859228
H  -0.984364 3.189001 -1.423976
H  -1.966873 4.110975 -0.240645
H  -0.241224 4.509279 -0.452274
H  1.51417 3.172839 -1.068085
H  0.098843 0.313844 1.874598
H  3.595683 1.863663 -1.343422
H  2.199474 -0.987861 1.617973
H  -3.161341 -1.170402 -1.357257
H  -3.68148 0.370065 1.15973
H  -5.163963 -1.691286 0.936046
H  -5.123313 -2.594746 -0.60249
H  3.355359 -2.393286 0.205378
H  5.609795 1.279496 -0.356733
H  5.451062 -3.719771 -0.055617
H  7.697739 -0.049678 -0.66762
H  7.637771 -2.559561 -0.506171
H  -4.461146 -3.384454 2.372743
H  -2.929461 -4.223933 2.176912
H  -6.217216 -0.458787 -2.967851
