program: Gaussian 09
title: 000086654
version: EM64L-G09RevD.01
frameworkgroup: C1[X(C13H11ClN2O)]
method: RPBEPBE
basis: SDD
operation: Freq
keyword: #p
keyword: freq=noraman
keyword: PBEPBE/SDD
title: #p freq=noraman PBEPBE/SDD
converged: YES YES NO NO
title: Mulliken charges:
elementType: Cl O N N C C C C C C C C C C C C C H H H H H H H H H H H
charge: -0.080243 -0.402296 -0.679669 -0.201164 0.213079 0.065163 0.314090 0.285323 -0.281679 -0.408655 -0.351615 -0.372898 -0.163719 -0.225013 -0.227765 -0.224276 -0.235453 0.278000 0.220400 0.246220 0.256488 0.251715 0.228078 0.230625 0.230233 0.294972 0.377897 0.362161
chargesum: 0.00000
title: Mulliken charges with hydrogens summed into heavy atoms:
elementType: Cl O N N C C C C C C C C C C C C C
charge: -0.080243 -0.040135 -0.006800 -0.201164 0.213079 0.065163 0.314090 0.285323 -0.003679 -0.188254 -0.105395 -0.116411 -0.163719 0.026702 0.000312 0.006350 -0.005219
polarizability: 2.23787211e+02 -4.45220663e+00 2.05129904e+02 -1.21116145e+01 -4.18606303e+00 9.86837464e+01
1716.lowfreq: -6.9807 -0.0022 -0.0019 0.0010 7.2960 9.2856 23.7893 45.0838 63.5602
frequency: 23.2071 44.9884 63.5556 102.5180 119.2094 157.8195 203.8413 216.9855 256.7209 265.8473 291.0240 321.8341 348.4985 376.1408 388.5302 400.6440 443.1298 454.9547 460.1433 470.2429 536.0075 565.3813 611.3194 635.7203 653.8438 665.6258 702.0348 717.9612 726.4763 766.4526 775.2036 807.9972 818.7157 855.6015 894.3836 906.2616 927.2597 935.7469 968.5317 979.6195 989.9461 997.4590 1028.0716 1054.8290 1081.3604 1091.4876 1144.8979 1162.4811 1173.7826 1190.8927 1263.0310 1283.3522 1306.5262 1318.0380 1329.3322 1374.1647 1400.9840 1419.0741 1432.1394 1476.3819 1480.0248 1522.2718 1556.1729 1586.2382 1594.1365 1610.4417 1617.8905 3126.7296 3129.9097 3134.8226 3146.5669 3157.3668 3168.8596 3170.1666 3177.5976 3310.9227 3555.0361 3634.9156
redmass: 4.7249 4.8650 6.5689 5.3887 5.8123 7.8528 4.7557 6.8672 6.6797 4.6998 4.5332 4.6983 11.9448 7.9240 1.2599 2.7372 1.5222 2.8721 2.4043 3.7793 3.7507 4.6170 6.3620 7.6317 5.4651 7.4361 1.8247 2.5629 3.1972 1.5097 2.1392 1.5215 4.7939 1.2522 1.3866 8.3931 1.5012 1.3377 5.5074 1.4266 5.5996 1.3256 2.2744 1.7211 1.6078 2.0863 2.7093 1.1786 1.0530 1.1151 1.5334 1.4466 2.5705 1.6015 2.0947 7.6368 8.3794 4.0258 2.2899 2.6908 2.5095 5.2071 2.3064 5.8094 2.1538 6.0899 4.8463 1.0847 1.0890 1.0882 1.0930 1.0966 1.1014 1.0957 1.0915 1.0608 1.0673 1.0906
irintensity: 0.4879 0.2927 0.8900 2.4098 0.6477 0.2350 0.1746 0.5168 6.0831 1.7392 3.9682 10.6192 1.8272 4.7101 59.6258 3.8753 119.5097 17.4462 40.3475 8.2568 28.8339 8.1652 0.6836 12.5828 28.2061 60.1912 62.7734 12.9426 24.6421 126.6471 35.5817 26.2855 14.5223 1.1482 11.7872 62.6473 5.4349 0.2830 49.3630 0.3422 1.5426 0.3638 11.1383 16.2383 7.5799 14.3718 35.7505 33.4696 0.0215 1.7826 134.8393 8.2448 14.7775 1.8849 29.6872 0.7329 6.9554 18.0413 9.6989 12.9234 74.4198 68.8206 30.6562 2.5316 149.9986 0.2771 111.3152 0.6487 16.1552 2.5994 23.5972 27.5643 16.7135 6.9502 1.2155 123.5485 64.4467 58.7786
temp: 298.150 k
press: 1.00000 atm
elementType: 17 8 7 7 6 6 6 6 6 6 6 6 6 6 6 6 6 1 1 1 1 1 1 1 1 1 1 1
symmnumber: 1
zpe: 550630.8 jmol-1
zpe.correction: 0.209724 hartree
zpe.thermalcorrener: 0.224684 hartree
zpe.thermalcorrenthalpy: 0.225628 hartree
zpe.thermalcorrgfe: 0.166560 hartree
zpe.sumelectzpe: -1145.539639 hartree
zpe.sumelectthermal: -1145.524679 hartree
zpe.sumelectthermalent: -1145.523735 hartree
zpe.sumelectthermalfe: -1145.582803 hartree
dipole: 0.9377 3.5596 0.3510
dipole: 3.6977
quadrupole: -97.0177 -89.8941 -105.4061
quadrupole: -11.4634 -4.0926 -1.6218
quadrupole: 0.4216 7.5452 -7.9668 -11.4634 -4.0926 -1.6218
hfenergy: -1145.7493628 hartree
pointgroup: C01 [X(C13H11Cl1N2O1)]
dipole: -0.268038 1.2483697 0.6972375 debye
polarizability: 213.0528528|23.5558912|173.3071153|-29.9566002|44.6381458|141.240894 unknown
InChI: InChI=1S/C13H11ClN2O/c14-10-6-7-12(15)11(8-10)13(16-17)9-4-2-1-3-5-9/h1-8,17H,15H2
charge 0 multiplicity 1
28 atoms
Cl 2.767929 -2.411161 -2.201221
O  -2.10198 1.96429 1.65306
N  1.74058 2.731993 0.799644
N  -0.706159 1.858684 1.231137
C  0.873377 0.594775 -0.079497
C  -0.495883 0.799422 0.444334
C  -1.597811 -0.151208 0.069297
C  1.939513 1.562162 0.091776
C  1.166231 -0.614501 -0.779968
C  3.218522 1.290588 -0.48564
C  -2.261285 -0.919503 1.0592
C  -1.998029 -0.275125 -1.286245
C  2.436603 -0.844979 -1.314653
C  3.475685 0.102396 -1.185221
C  -3.296582 -1.807935 0.69696
C  -3.043969 -1.153582 -1.645896
C  -3.692937 -1.926495 -0.655758
H  0.386253 -1.371221 -0.891699
H  4.020013 2.029321 -0.367045
H  -1.966739 -0.81684 2.108355
H  -1.494153 0.320638 -2.055472
H  4.462892 -0.090285 -1.615155
H  -3.797002 -2.402678 1.469075
H  -3.346939 -1.236438 -2.69539
H  -4.499836 -2.613364 -0.934616
H  2.490058 3.413919 0.885253
H  0.817342 2.86428 1.239618
H  -2.096596 2.799648 2.188468
