program: Gaussian 09
title: 000086623
version: EM64L-G09RevD.01
frameworkgroup: C1[X(C12H20O2)]
method: RPBEPBE
basis: SDD
operation: Freq
keyword: #pfreq=noraman
keyword: PBEPBE/SDD
title: #p freq=noraman PBEPBE/SDD
converged: NO YES NO NO
title: Mulliken charges:
elementType: O O C C C C C C C C C C C C H H H H H H H H H H H H H H H H H H H H
charge: -0.236530 -0.208596 -0.386486 -0.366626 -0.383040 -0.400712 -0.372692 -0.103462 -0.353479 -0.356484 -0.176908 -0.696048 -0.323381 0.167228 0.188892 0.200711 0.187688 0.238351 0.199575 0.192312 0.203515 0.230347 0.191414 0.188248 0.241905 0.190108 0.187541 0.193984 0.195541 0.258934 0.210671 0.215411 0.209467 0.272601
chargesum: 0.00000
title: Mulliken charges with hydrogens summed into heavy atoms:
elementType: O O C C C C C C C C C C C C
charge: -0.236530 -0.208596 0.003117 0.059413 0.008847 0.033150 0.006970 0.138443 0.024170 0.033041 0.082026 -0.060499 -0.050781 0.167228
polarizability: 1.76274881e+02 9.61988598e+00 1.28705367e+02 -9.49851353e+00 -2.73122001e+00 1.01465069e+02
1716.lowfreq: -6.9182 -0.0005 -0.0002 0.0006 7.1168 17.5926 23.7680 43.3688 49.2578
frequency: 23.5877 43.0182 48.1402 59.1538 91.6894 102.4144 108.5694 134.8136 146.8320 156.2796 190.7391 195.9821 237.5693 287.5660 315.7317 379.0474 421.2602 466.8340 490.0087 519.7381 634.7790 675.9798 723.8438 727.6309 739.9083 758.2695 784.5887 799.2526 817.1975 841.8371 879.1544 888.2651 938.9339 955.7476 980.8915 995.3161 1005.9738 1017.8090 1038.7313 1049.9020 1063.8857 1071.5182 1080.0726 1081.0992 1117.7570 1123.8411 1134.0809 1187.5722 1205.0224 1222.4546 1235.2754 1255.4667 1266.8719 1279.1282 1283.1585 1291.7519 1295.4287 1301.1773 1302.6811 1318.9059 1333.8738 1351.4770 1356.2780 1359.4228 1388.5108 1445.7945 1460.9728 1461.6739 1465.6363 1470.7713 1477.9116 1477.9268 1484.4375 1488.5313 1600.1332 1698.4637 2948.8907 2950.4285 2953.0017 2959.6614 2965.9491 2967.7050 2971.6755 2973.8131 2984.2781 2989.4907 2992.1588 3003.7836 3020.2243 3030.7300 3038.6237 3057.1901 3068.2866 3070.9291 3179.1441 3225.8247
redmass: 4.5706 3.4805 2.0116 3.4190 1.8658 3.1395 3.1924 2.0590 2.2184 2.6587 3.8779 3.9966 1.1057 3.3775 3.3295 3.8716 3.2291 4.1822 3.2946 2.8903 4.7053 3.2793 1.0612 1.1213 1.4673 2.1512 1.5818 1.9109 3.1054 2.0687 1.6662 1.8954 1.3143 1.3293 4.0728 3.4874 1.3417 2.6784 1.6429 2.7199 3.2614 2.3003 2.2857 2.1836 1.9312 1.8796 1.7208 1.7437 1.2760 1.4287 1.3776 1.3152 1.3659 1.2430 1.0271 1.1625 1.1066 1.1545 1.3083 1.6606 1.4832 1.5490 1.6673 1.6241 1.2174 1.0817 1.0742 1.0721 1.0697 1.0796 1.0715 1.0510 1.0874 1.0918 6.8027 12.1183 1.0590 1.0589 1.0593 1.0597 1.0628 1.0599 1.0364 1.0624 1.0961 1.0837 1.0976 1.1008 1.1018 1.0994 1.1040 1.1030 1.1007 1.0993 1.0915 1.1062
irintensity: 1.4999 0.5537 1.9251 1.0835 0.0595 0.9361 1.2200 0.0097 0.0832 0.2435 0.1574 2.0814 0.0008 0.4150 0.6734 0.0332 1.6717 1.7893 1.0742 3.9635 1.9601 3.2481 15.9993 1.7544 11.1316 3.0812 9.1169 68.6113 39.5366 25.3032 16.5544 6.6153 0.7273 2.2050 11.8059 9.6522 2.1143 7.6849 48.3072 6.3512 44.1278 30.4871 1.3411 2.4151 4.1932 11.7645 3.8918 0.5400 6.6529 0.1851 4.7353 1.8457 2.1018 1.0630 0.6534 1.0513 0.8086 0.4364 0.4211 3.1304 0.0662 1.0171 0.1894 0.5044 11.2774 4.0274 0.0718 0.0889 0.2966 1.3803 4.3453 10.1564 3.3807 29.5532 2.5171 402.8615 0.5546 4.5130 0.2754 23.5064 4.5174 149.3996 38.3704 52.5238 3.2720 12.2051 4.2328 3.2338 2.5068 19.4937 80.1693 95.6204 98.6098 54.7201 2.3931 2.0639
temp: 298.150 k
press: 1.00000 atm
elementType: 8 8 6 6 6 6 6 6 6 6 6 6 6 6 1 1 1 1 1 1 1 1 1 1 1 1 1 1 1 1 1 1 1 1
symmnumber: 1
zpe: 774365.1 jmol-1
zpe.correction: 0.294940 hartree
zpe.thermalcorrener: 0.310937 hartree
zpe.thermalcorrenthalpy: 0.311881 hartree
zpe.thermalcorrgfe: 0.249184 hartree
zpe.sumelectzpe: -618.598997 hartree
zpe.sumelectthermal: -618.583000 hartree
zpe.sumelectthermalent: -618.582056 hartree
zpe.sumelectthermalfe: -618.644753 hartree
dipole: -1.4951 -5.3586 0.1294
dipole: 5.5647
quadrupole: -94.4113 -91.8817 -86.1133
quadrupole: -23.1123 0.0935 -0.7292
quadrupole: -3.6092 -1.0796 4.6888 -23.1123 0.0935 -0.7292
hfenergy: -618.893937 hartree
pointgroup: C01 [X(C12H20O2)]
dipole: -0.5968587 2.1062853 -0.0225432 debye
polarizability: 176.2983429|-9.5512377|128.6980809|9.5921109|-2.330592|101.4488929 unknown
InChI: InChI=1S/C12H20O2/c1-2-3-4-5-6-7-8-11-9-10-12(13)14-11/h9-11H,2-8H2,1H3
charge 0 multiplicity 1
34 atoms
O  3.073166 -0.761682 -0.460794
O  4.825545 -2.10049 0.33965
C  -1.054121 0.673239 0.292695
C  0.257771 0.367772 -0.462555
C  -2.29212 0.019005 -0.360868
C  1.487173 1.034858 0.191136
C  -3.608993 0.315034 0.391022
C  2.804144 0.706149 -0.541075
C  -4.846381 -0.341316 -0.261638
C  -6.16413 -0.046364 0.490694
C  4.043932 1.341474 0.05542
C  -7.395038 -0.704666 -0.16915
C  4.920696 0.38092 0.448607
C  4.356864 -0.965975 0.145425
H  -1.206318 1.772188 0.346214
H  -0.965168 0.319663 1.341028
H  0.166317 0.713269 -1.513787
H  0.422878 -0.725706 -0.502657
H  -2.139163 -1.078944 -0.414414
H  -2.382248 0.37092 -1.410012
H  1.36129 2.13749 0.19442
H  1.581825 0.713982 1.246376
H  -3.519159 -0.036614 1.440322
H  -3.762925 1.41355 0.444157
H  2.705463 0.944037 -1.619925
H  -4.694245 -1.439761 -0.314954
H  -4.938666 0.009895 -1.310899
H  -6.314403 1.051463 0.544687
H  -6.071533 -0.398748 1.538415
H  4.160903 2.424248 0.143073
H  -7.282678 -1.804783 -0.207034
H  -8.323792 -0.478902 0.386525
H  -7.526578 -0.346266 -1.207719
H  5.895093 0.50026 0.921513
