program: Gaussian 09
title: 000086649
version: EM64L-G09RevD.01
frameworkgroup: C1[X(C24H19NO3)]
method: RPBEPBE
basis: SDD
operation: Freq
keyword: #p
keyword: freq=noraman
keyword: PBEPBE/SDD
title: #p freq=noraman PBEPBE/SDD
converged: YES YES NO NO
title: Mulliken charges:
elementType: O O O N C C C C C C C C C C C C C C C C C C C C C C C C H H H H H H H H H H H H H H H H H H H
charge: -0.267716 -0.289297 -0.255028 -0.062364 0.044077 0.231783 0.324620 0.053304 0.472875 -0.539670 0.518752 -0.362398 -0.373809 -0.391003 -0.334593 -0.413142 -0.389822 -0.326519 -0.818543 0.528192 -0.326614 -0.389361 -0.404858 0.231955 -0.364892 -0.347510 0.164855 -0.500587 0.259572 0.252355 0.263374 0.271429 0.234453 0.230809 0.226980 0.220585 0.231566 0.231550 0.229028 0.220594 0.227396 0.230545 0.269246 0.271727 0.242399 0.231273 0.242431
chargesum: 0.00000
title: Mulliken charges with hydrogens summed into heavy atoms:
elementType: O O O N C C C C C C C C C C C C C C C C C C C C C C C C
charge: -0.267716 -0.289297 -0.255028 -0.062364 0.044077 0.231783 0.324620 0.053304 0.472875 -0.280098 0.518752 -0.110042 -0.110435 -0.119574 -0.100140 -0.182333 -0.162842 -0.105934 -0.126399 0.528192 -0.106020 -0.161965 -0.174314 0.231955 -0.095646 -0.075783 0.164855 0.215516
polarizability: 9.03481318e+02 -4.92142443e+00 2.54843200e+02 -5.85132960e-02 6.40911008e-02 1.14216699e+02
1716.lowfreq: -2.6310 -1.2825 -0.0017 0.0009 0.0019 2.1738 13.8745 18.6516 26.1096
frequency: 13.8313 18.5963 26.1086 36.9885 53.6827 56.7233 64.8188 72.7581 77.7700 102.3034 121.8214 123.8696 135.3107 145.8299 183.9491 194.9709 222.9018 260.9601 274.2130 287.4688 306.0530 311.2041 337.9365 366.9811 384.4382 393.1697 407.4219 408.1355 435.6902 450.1250 478.4403 492.2227 498.4928 535.6546 540.6430 595.5900 596.5388 629.4333 630.8945 636.6641 676.3948 679.7158 680.0116 744.6404 745.6785 752.8701 758.9073 767.2973 802.2924 811.4267 822.0040 836.0322 846.9941 847.1229 852.6120 863.7986 867.5045 892.1274 909.2992 921.5288 930.7472 949.1587 971.8694 976.1338 985.8760 991.8631 996.0713 999.5208 1003.5341 1007.9971 1014.1172 1049.4998 1067.9113 1112.8784 1113.3205 1119.0626 1121.4138 1135.6094 1148.1364 1173.6978 1188.1371 1194.8624 1205.7994 1234.3745 1246.4477 1262.1623 1268.9793 1278.6741 1293.8366 1302.8784 1321.2905 1330.8775 1374.9834 1382.4854 1392.5507 1402.0825 1423.0271 1424.2433 1425.2470 1433.3141 1452.1242 1461.3441 1463.8424 1471.7308 1475.7630 1486.3510 1502.8290 1549.4210 1559.3361 1565.0774 1603.6021 1609.5375 1618.4472 1620.7395 1627.2208 1645.0698 2978.7771 3003.3137 3056.3794 3088.0753 3094.4154 3104.4504 3104.9821 3126.3015 3126.6144 3133.0354 3139.8456 3140.7406 3147.0699 3160.6798 3162.6984 3164.5789 3170.0716 3175.7164 3178.0708
redmass: 5.5727 4.7446 5.6698 5.3199 3.9674 1.0702 4.1985 5.5902 4.3432 1.3966 7.7033 2.4407 4.6734 3.7215 3.3335 4.5837 4.8034 4.6527 4.3670 5.5299 4.7114 4.0526 5.0099 3.9694 4.6449 5.5129 2.8832 2.8652 3.1158 5.6886 6.1386 2.9650 5.0030 6.6511 2.9537 5.9692 3.3236 7.0323 6.9868 6.9632 5.2508 6.3289 4.5078 3.4154 6.4441 4.8079 5.7488 4.0101 5.9069 1.3457 5.7562 1.5049 10.8086 1.2910 1.3297 1.7226 4.2342 1.3867 2.1293 8.1372 2.9649 1.3372 1.2344 8.9271 1.3813 1.3744 1.3512 1.2916 1.5091 3.1358 2.6006 1.5349 4.6328 2.1808 1.2640 1.4586 1.5393 2.0437 1.4700 1.9521 1.1655 1.2443 2.4378 2.9658 1.6993 2.7906 2.2524 2.0941 2.3067 1.4106 1.5952 1.3614 4.2885 4.2035 3.2991 1.2531 2.0744 1.7574 3.5343 3.9887 1.0497 2.0058 1.0520 1.0452 2.7474 1.4400 2.7641 5.8592 7.0428 6.6851 5.5183 7.7950 8.7865 6.8185 7.2925 5.6233 1.0375 1.0296 1.0977 1.0985 1.0918 1.1044 1.0861 1.0900 1.0896 1.0896 1.0875 1.0877 1.1046 1.0930 1.0963 1.0958 1.0957 1.0960 1.0947
irintensity: 0.2596 0.6973 0.0682 0.0705 0.3006 0.7022 1.9102 0.2529 0.5380 0.7773 0.1618 0.1888 2.5628 1.7904 5.8884 0.3730 0.3132 0.4442 15.9437 0.4289 19.5242 0.6685 0.4170 4.5245 2.0727 1.1130 0.1989 0.2003 4.5825 0.4382 3.9482 0.1017 2.3963 0.2645 29.2795 2.8597 3.5033 0.7565 1.8828 1.7428 0.6916 1.3583 49.6425 1.4788 5.0174 0.1072 5.1841 3.1406 26.8568 56.7908 5.8167 1.2748 27.5252 0.6231 0.5854 88.0276 2.2143 8.6724 0.1545 3.5029 5.7824 1.9077 45.5039 88.1493 6.4012 3.4163 6.2138 8.7351 24.3952 34.3100 2.6485 12.3677 354.1928 11.9709 0.0517 6.3073 1.3096 6.0250 126.9931 26.0761 118.0562 1.0672 3.8631 39.1658 206.4381 361.2543 5.0552 7.3400 6.7160 0.0369 12.3791 0.8805 10.6483 4.0253 0.0783 12.3299 13.8721 39.5291 28.9972 16.8032 13.9545 8.9525 17.1490 13.5760 117.7085 16.2521 33.8213 51.5566 44.9973 0.6139 126.3885 21.6585 393.5687 67.5523 19.0778 3.5332 53.7875 64.3681 20.5486 16.4509 0.4524 27.3774 45.0434 0.4667 35.2206 14.0097 3.9488 8.7982 18.4010 8.3498 5.7793 7.1120 2.1044 10.6888 3.2097
temp: 298.150 k
press: 1.00000 atm
elementType: 8 8 8 7 6 6 6 6 6 6 6 6 6 6 6 6 6 6 6 6 6 6 6 6 6 6 6 6 1 1 1 1 1 1 1 1 1 1 1 1 1 1 1 1 1 1 1
symmnumber: 1
zpe: 952298.0 jmol-1
zpe.correction: 0.362711 hartree
zpe.thermalcorrener: 0.387297 hartree
zpe.thermalcorrenthalpy: 0.388241 hartree
zpe.thermalcorrgfe: 0.304518 hartree
zpe.sumelectzpe: -1204.457704 hartree
zpe.sumelectthermal: -1204.433118 hartree
zpe.sumelectthermalent: -1204.432174 hartree
zpe.sumelectthermalfe: -1204.515897 hartree
dipole: -1.9840 -0.9797 0.0066
dipole: 2.2128
quadrupole: -127.1567 -150.5445 -170.1814
quadrupole: -21.3676 -0.0245 0.0046
quadrupole: 22.1375 -1.2503 -20.8872 -21.3676 -0.0245 0.0046
hfenergy: -1204.8204152 hartree
pointgroup: C01 [X(C24H19N1O3)]
dipole: 0.7817712 0.3830152 -0.004068 debye
polarizability: 903.4093454|-6.9519547|254.8780467|-5.2468691|-0.5194046|114.2538247 unknown
InChI: InChI=1S/C24H19NO3/c1-16-3-14-22-21(15-16)25-23(28-22)19-10-6-17(7-11-19)4-5-18-8-12-20(13-9-18)24(26)27-2/h3-15H,1-2H3
charge 0 multiplicity 1
47 atoms
O  4.844025 -1.274826 -0.000385
O  -9.109935 1.040678 0.088728
O  -9.039685 -1.289865 0.094296
N  4.787336 1.049392 -0.012459
C  6.136978 0.618748 -0.017186
C  6.175446 -0.80421 -0.009633
C  2.609352 -0.209007 0.006035
C  4.056989 -0.064106 -0.002704
C  8.564067 0.649734 -0.029289
C  7.339285 1.358076 -0.027107
C  -0.245026 -0.429212 0.024011
C  7.365169 -1.540467 -0.011658
C  1.988973 -1.487662 0.016384
C  1.792006 0.958977 0.004146
C  8.558195 -0.781925 -0.0216
C  0.588086 -1.587801 0.024994
C  0.395819 0.848887 0.012875
C  -1.701115 -0.607108 0.034249
C  9.890733 1.39114 -0.039775
C  -4.10632 0.205916 0.053708
C  -2.649521 0.385854 0.042775
C  -4.74474 -1.072587 0.062812
C  -4.938909 1.365422 0.056029
C  -6.957496 -0.014257 0.075248
C  -6.142947 -1.179894 0.073291
C  -6.34063 1.263605 0.06652
C  -8.434549 -0.187829 0.08688
C  -10.587788 0.94902 0.100253
H  7.315901 2.451924 -0.032806
H  7.375423 -2.633343 -0.005891
H  2.611271 -2.387396 0.017652
H  2.28099 1.938266 -0.004452
H  9.519154 -1.310024 -0.023564
H  0.119414 -2.579381 0.033122
H  -0.205765 1.763712 0.010453
H  -2.035508 -1.654273 0.035382
H  10.499367 1.138805 0.848867
H  10.491324 1.128409 -0.930875
H  9.743588 2.484355 -0.045513
H  -2.315958 1.433144 0.041755
H  -4.142573 -1.987006 0.062337
H  -4.469165 2.356531 0.049351
H  -6.635271 -2.157993 0.08045
H  -6.967924 2.159014 0.06817
H  -10.945031 0.411589 -0.794369
H  -10.933823 1.992195 0.101267
H  -10.931215 0.414379 1.001924
