program: Gaussian 09
title: 000086615
version: EM64L-G09RevD.01
frameworkgroup: C1[X(C16H22N2O)]
method: RPBEPBE
basis: SDD
operation: Freq
keyword: #p
keyword: freq=noraman
keyword: PBEPBE/SDD
title: #p freq=noraman PBEPBE/SDD
converged: YES YES NO NO
title: Mulliken charges:
elementType: O N N C C C C C C C C C C C C C C C C H H H H H H H H H H H H H H H H H H H H H H
charge: -0.293370 -0.079233 -0.126871 -0.343798 -0.342883 -0.395955 -0.396931 -0.435909 0.256303 -0.491107 -0.182016 -0.673793 -0.340322 0.493461 -0.396873 -0.401979 -0.233984 -0.236201 -0.243460 0.232474 0.192650 0.180678 0.211489 0.260383 0.220433 0.222543 0.225862 0.211956 0.194599 0.226302 0.222945 0.239316 0.201114 0.230332 0.233840 0.223158 0.225693 0.227910 0.225147 0.226593 0.229502
chargesum: 0.00000
title: Mulliken charges with hydrogens summed into heavy atoms:
elementType: O N N C C C C C C C C C C C C C C C C
charge: -0.293370 -0.079233 -0.126871 0.081326 0.049284 0.084862 0.051474 -0.029354 0.256303 -0.041860 0.057300 -0.008507 -0.117164 0.493461 -0.171180 -0.174069 -0.008837 -0.009607 -0.013958
polarizability: 2.92376707e+02 -3.12076597e+01 1.49702453e+02 4.08365942e+00 5.11733293e+00 1.57596034e+02
1716.lowfreq: -4.0404 -1.5044 -0.0009 -0.0005 0.0004 14.7179 20.4371 25.6189 27.1767
frequency: 20.4064 25.5765 27.1471 48.2543 70.3295 87.7670 113.7503 124.8227 134.4064 166.9073 201.8755 227.2790 242.6685 252.6898 275.7965 311.0609 323.7073 356.0642 373.0677 403.3048 406.2445 454.1671 475.2820 487.7651 523.0796 548.8554 562.0879 607.3673 616.1736 624.9541 696.7847 722.0137 744.5732 770.1864 813.4179 817.4447 838.3485 846.2102 858.9257 899.9173 921.4783 930.5187 977.0853 985.6767 988.0254 994.7669 996.0500 999.3919 1008.9804 1027.2638 1041.1297 1052.3196 1072.9836 1076.7255 1079.5004 1096.3317 1104.5194 1132.1247 1141.3256 1172.2879 1182.8242 1190.7597 1197.4065 1219.3011 1221.3800 1236.6357 1258.0769 1267.0710 1282.7157 1292.3708 1304.0581 1314.5640 1327.9863 1335.4469 1342.2857 1355.4299 1360.0351 1381.9982 1391.0698 1395.8198 1416.6387 1440.5680 1450.8830 1452.9177 1460.0912 1463.1434 1464.8221 1466.4688 1473.0019 1479.5124 1485.5763 1584.8389 1586.0152 1612.4022 1667.0791 2843.4970 2853.0007 2865.5572 2969.5825 2970.8072 2977.5612 2982.3296 2998.0747 3019.9318 3026.9191 3049.5789 3074.5252 3092.0641 3093.8060 3098.2023 3107.2185 3108.4652 3117.1833 3125.1335 3137.8818 3148.3481 3164.7287
redmass: 4.1202 3.7627 4.7143 4.1910 3.9973 3.4328 1.8909 3.9667 2.7682 2.5928 1.2615 3.9250 2.9802 2.3005 3.2225 2.3844 3.1462 4.6821 2.8433 2.7330 2.0556 3.0507 3.3493 2.9769 3.6739 2.7939 3.8013 3.7670 6.4143 2.4789 1.7773 3.2967 2.2268 2.1832 1.3443 2.8513 1.5704 1.4545 1.7429 3.2092 1.5780 2.1229 1.3846 1.1956 5.1533 2.4558 1.9454 1.2654 1.9035 2.1440 2.1247 1.7349 1.6838 1.9162 2.1750 2.3502 2.4636 2.5243 3.2279 1.0633 1.6216 1.1372 1.0964 1.6388 1.7414 2.1563 1.1841 1.5559 1.3375 1.3604 1.5604 1.5351 1.3163 1.2740 1.3224 1.4237 1.3562 2.7060 2.1921 1.2217 2.5933 2.2548 1.1154 1.0916 1.0768 1.0818 1.0998 1.0508 1.1037 1.0561 2.3091 5.8035 7.4421 6.0008 6.1760 1.0699 1.0706 1.0690 1.0612 1.0672 1.0876 1.0668 1.0370 1.0999 1.0890 1.0892 1.0901 1.0954 1.0995 1.0929 1.0892 1.1002 1.0869 1.0859 1.0912 1.0960 1.1015
irintensity: 0.0583 0.7324 0.3673 0.9809 1.5533 0.4706 1.6822 1.2671 0.9285 2.4975 0.3562 1.1592 4.9459 2.0440 1.1414 8.1969 14.5403 6.2927 1.5549 0.0126 0.2465 2.5642 1.8232 7.1788 0.3587 0.7351 12.2573 2.7971 0.0238 3.8221 40.3991 0.8983 37.4224 36.3395 14.2067 0.3257 0.7049 0.5317 1.4898 2.1388 2.7516 7.8970 0.6751 54.3468 0.4844 99.3734 2.5286 17.8422 8.2910 2.1469 24.0105 1.0523 0.8174 7.7473 6.2798 4.5244 1.7247 90.8404 10.4531 0.2450 4.0393 0.3603 8.0272 174.2744 16.4609 5.0766 0.5883 11.2416 14.9902 7.1603 21.7001 13.9576 23.3499 0.2149 9.8919 5.4166 5.1050 1.0146 14.8587 18.3190 140.1565 8.3237 31.1992 1.8980 6.8052 5.6823 31.5551 2.5265 5.3177 18.6873 17.5709 2.0863 269.1344 6.3251 0.7997 43.0224 62.0668 149.2891 17.5013 54.7551 23.7244 49.7472 37.4234 15.5274 51.7627 28.0511 17.9171 6.6858 25.7775 28.0299 20.4414 31.1487 12.1124 0.8706 10.9535 44.7437 26.3811
temp: 298.150 k
press: 1.00000 atm
elementType: 8 7 7 6 6 6 6 6 6 6 6 6 6 6 6 6 6 6 6 1 1 1 1 1 1 1 1 1 1 1 1 1 1 1 1 1 1 1 1 1 1
symmnumber: 1
zpe: 915650.2 jmol-1
zpe.correction: 0.348753 hartree
zpe.thermalcorrener: 0.367471 hartree
zpe.thermalcorrenthalpy: 0.368416 hartree
zpe.thermalcorrgfe: 0.299222 hartree
zpe.sumelectzpe: -806.178030 hartree
zpe.sumelectthermal: -806.159311 hartree
zpe.sumelectthermalent: -806.158367 hartree
zpe.sumelectthermalfe: -806.227560 hartree
dipole: 1.4121 3.8377 0.0917
dipole: 4.0903
quadrupole: -114.0180 -121.9068 -107.7375
quadrupole: -22.4013 -2.1439 -0.8683
quadrupole: 0.5362 -7.3527 6.8166 -22.4013 -2.1439 -0.8683
hfenergy: -806.5267825 hartree
pointgroup: C01 [X(C16H22N2O1)]
dipole: 0.5432357 -1.4971392 -0.2304861 debye
polarizability: 292.6634876|30.7523957|148.238114|-2.6856963|3.4410314|158.7735924 unknown
InChI: InChI=1S/C16H22N2O/c1-2-16(19)18-13-11-17(12-14-18)10-6-9-15-7-4-3-5-8-15/h3-9H,2,10-14H2,1H3
charge 0 multiplicity 1
41 atoms
O  -4.649282 2.039164 0.529772
N  -0.885844 -1.045675 -0.2444
N  -3.456969 0.24077 -0.33155
C  -1.057859 0.330165 0.289904
C  -2.127043 -1.835515 -0.070365
C  -2.216688 1.042414 -0.429128
C  -3.302463 -1.149035 -0.800096
C  0.312053 -1.73438 0.303903
C  -4.628322 0.825865 0.147691
C  -5.89103 -0.05481 0.193724
C  1.598172 -1.101344 -0.17628
C  -7.120661 0.733184 0.680862
C  2.623849 -0.733481 0.642952
C  3.922989 -0.151473 0.246487
C  4.29706 0.072016 -1.110466
C  4.852564 0.207029 1.263533
C  5.547699 0.635588 -1.431446
C  6.106208 0.770606 0.943631
C  6.460443 0.988857 -0.407233
H  -0.120474 0.891102 0.127406
H  -1.262113 0.315788 1.391038
H  -2.395946 -1.957992 1.011232
H  -1.972741 -2.843249 -0.500269
H  -2.422071 2.027812 0.019121
H  -1.953458 1.178042 -1.49739
H  -3.086963 -1.147975 -1.888602
H  -4.228197 -1.71899 -0.630548
H  0.268812 -2.784386 -0.054482
H  0.304007 -1.773734 1.423437
H  -6.08508 -0.474859 -0.813627
H  -5.709567 -0.92085 0.862273
H  1.662129 -0.963266 -1.264612
H  -8.007637 0.075128 0.723765
H  -7.33691 1.578787 0.0067
H  -6.941442 1.157686 1.682554
H  2.487345 -0.877646 1.72643
H  3.608141 -0.198983 -1.918218
H  4.582998 0.041421 2.314378
H  5.816638 0.799622 -2.481204
H  6.804341 1.038886 1.744467
H  7.432612 1.425712 -0.660843
