program: Gaussian 09
title: 000086592
version: EM64L-G09RevD.01
frameworkgroup: C1[X(C9H12O)]
method: RPBEPBE
basis: SDD
operation: Freq
keyword: #pfreq=noraman
keyword: PBEPBE/SDD
title: #p freq=noraman PBEPBE/SDD
converged: YES YES NO NO
title: Mulliken charges:
elementType: O C C C C C C C C C H H H H H H H H H H H H
charge: -0.246140 -0.140026 -0.228220 -0.186054 -0.310040 -0.203570 0.182359 -0.148380 -0.783281 -0.739134 0.263583 0.228821 0.222351 0.228619 0.230036 0.219667 0.232088 0.232445 0.253284 0.231982 0.227569 0.232040
chargesum: 0.00000
title: Mulliken charges with hydrogens summed into heavy atoms:
elementType: O C C C C C C C C C
charge: -0.246140 0.123557 0.000601 0.042565 -0.087689 0.026466 0.182359 0.071287 -0.065464 -0.047543
polarizability: 2.97208208e+02 1.60003741e+01 9.08259180e+01 -1.90923934e-02 5.20405054e-03 5.22537701e+01
1716.lowfreq: -3.9245 -0.0009 -0.0008 -0.0006 4.5424 24.8214 49.0202 59.8919 78.3105
frequency: 49.0158 59.8839 78.2345 89.6590 129.2500 156.3363 190.4157 210.2669 263.5835 287.8003 293.5120 377.7106 418.6254 474.9562 552.3923 572.0624 608.4284 791.3368 852.0326 894.6145 909.9358 927.5891 933.5289 950.4208 984.1868 1020.4847 1033.2169 1038.0484 1097.4427 1159.6600 1168.5858 1202.1379 1237.6458 1265.1508 1289.2426 1291.6651 1303.9680 1351.7933 1367.1588 1392.8241 1442.8257 1456.3534 1456.6687 1465.9001 1551.4387 1592.0966 1633.3492 1655.3459 2963.1769 2977.9451 3033.6531 3060.4505 3074.6712 3083.3789 3086.5026 3091.5358 3098.1520 3102.4969 3109.9420 3123.8629
redmass: 3.6740 4.1113 1.0722 2.0344 1.8265 4.1662 1.5550 2.5176 4.3083 2.2834 3.6687 2.5136 2.9836 4.0738 3.1387 2.5026 3.9404 1.3386 1.5298 4.2501 1.9453 1.5657 1.2082 1.6635 1.1242 1.5253 1.2494 1.5634 2.5221 2.3305 1.7483 1.7309 1.5304 1.6730 1.5970 1.3959 1.3151 1.6581 1.3082 1.2365 1.1024 1.0501 1.0476 1.0783 6.2011 5.3659 5.3800 5.5150 1.0372 1.0375 1.0960 1.0965 1.0937 1.0927 1.0927 1.0944 1.0913 1.0878 1.0887 1.0992
irintensity: 1.0423 0.4538 0.6250 0.9191 0.8445 5.1565 0.1586 1.6940 0.4222 0.6702 2.6619 0.3738 1.3361 19.0979 0.4526 0.3870 9.2527 1.9725 9.5054 0.0851 2.9207 20.4640 0.0512 108.1946 11.3646 80.7820 72.3535 1.8771 4.1222 114.0503 3.2619 0.5619 25.3421 164.4066 14.7351 5.5805 1.6160 61.9373 99.2012 6.0825 39.5196 20.4082 15.8504 56.9370 495.5818 17.1491 214.7709 3.5791 38.8834 4.7027 21.1198 17.1015 1.3490 1.9783 2.9997 3.3920 14.9295 61.4521 30.2955 25.0704
temp: 298.150 k
press: 1.00000 atm
elementType: 8 6 6 6 6 6 6 6 6 6 1 1 1 1 1 1 1 1 1 1 1 1
symmnumber: 1
zpe: 474526.0 jmol-1
zpe.correction: 0.180737 hartree
zpe.thermalcorrener: 0.192639 hartree
zpe.thermalcorrenthalpy: 0.193583 hartree
zpe.thermalcorrgfe: 0.142054 hartree
zpe.sumelectzpe: -424.586061 hartree
zpe.sumelectthermal: -424.574159 hartree
zpe.sumelectthermalent: -424.573215 hartree
zpe.sumelectthermalfe: -424.624744 hartree
dipole: 3.8323 -2.8352 0.0031
dipole: 4.7670
quadrupole: -52.1072 -59.7200 -64.2065
quadrupole: 12.2133 -0.0180 0.0109
quadrupole: 6.5707 -1.0421 -5.5286 12.2133 -0.0180 0.0109
hfenergy: -424.7667979 hartree
pointgroup: C01 [X(C9H12O1)]
dipole: 1.5136906 1.100108 -0.1264475 debye
dipolederiv: -0.9025868 -0.0028155 0.0061737 -0.777009 -0.8383739 0.0592284 0.0828375 0.051102 -0.3356008 1.155576 -0.0182289 -0.0106374 -0.0159865 0.0451578 -0.0095333 -0.0103742 -0.0097347 -0.0550047 -0.8804227 0.003625 0.0066372 0.0968872 0.1484747 -0.0345525 -0.0028521 -0.033449 -0.1890689 0.811286 -0.0165131 -0.0076618 -0.1586768 0.1125731 -0.0203573 0.0064675 -0.022043 -0.1107844 -1.9146474 -0.0073197 0.0178529 0.0454506 0.0728329 -0.0331772 0.0127795 -0.0323652 -0.2533394 -0.6398445 -0.0069293 0.005549 0.3390096 0.0853908 -0.028478 -0.0290799 -0.0247784 -0.1636735 2.3989303 -0.1497364 -0.008152 0.7371866 0.8487249 -0.0806074 -0.0951197 -0.0715419 0.1346294 0.6630628 0.0124253 -0.0100784 -0.1568894 0.1625251 -0.036966 0.0070246 -0.0389083 -0.2220232 -0.4785167 0.2493638 -0.0199452 0.4326821 -0.2184409 0.0242836 -0.0417962 0.0273043 0.0561891 -0.4245369 -0.0324954 0.0083022 0.1546864 0.0264578 0.0033519 -0.0122255 0.0054314 0.0766206 0.0697627 0.0095969 -0.0000657 -0.0113169 -0.0401017 0.0193272 0.0018057 0.0192147 0.1539702 0.0287533 -0.008206 0.002273 -0.064962 -0.1068475 0.0278313 0.0079328 0.0272133 0.166948 0.0617665 -0.01217 0.0023824 -0.0052274 -0.1187395 0.0287452 0.0015801 0.0286447 0.1683896 0.0345782 -0.0086338 0.0021143 -0.0604554 -0.0990731 0.0262881 0.0073049 0.0258214 0.1595995 0.031897 -0.0046734 0.0018382 -0.0927449 -0.1103626 0.0282398 0.0107167 0.0273716 0.162192 0.0280528 -0.0651462 0.0078873 -0.0653989 -0.1265745 0.0296507 0.0080125 0.0295639 0.1613821 0.0580028 -0.0061553 -0.0454749 -0.0101271 0.0181942 -0.1118401 0.0091517 -0.1221522 -0.0093746 0.0587506 0.006786 0.0423374 -0.0091025 0.0655957 0.0952166 -0.0089513 0.1051881 -0.0570942 -0.0957384 -0.0500354 0.008511 -0.1354609 0.0385477 0.010626 0.0184442 0.0089569 0.1194664 -0.0638899 0.0401083 0.0856005 -0.0599029 0.0733757 -0.0910041 0.1737116 -0.0779814 -0.0242686 0.0688386 0.0437452 -0.0040197 -0.0906751 -0.1423659 0.0269106 0.0100712 0.0254266 0.1097807 -0.0690745 0.023408 -0.0914242 -0.0919669 0.1030293 0.0668163 -0.1574415 0.0517151 -0.0489353 unknown
polarizability: 297.0024997|-17.2849447|90.660994|-0.7754217|-3.6454083|52.6244026 unknown
InChI: InChI=1S/C9H12O/c1-3-4-5-6-7-8-9(2)10/h3-8H,1-2H3
charge 0 multiplicity 1
22 atoms
O  -3.488191 -1.367705 0.197851
C  -0.892924 -0.105863 0.043263
C  0.420279 0.490452 -0.028971
C  1.588472 -0.245318 0.031777
C  -2.083522 0.586031 -0.012191
C  2.922927 0.321129 -0.037414
C  -3.393224 -0.105623 0.070687
C  4.071837 -0.426079 0.025538
C  -4.636154 0.777924 -0.005204
C  5.471217 0.125707 -0.04359
H  -0.963219 -1.19925 0.151526
H  0.483041 1.583652 -0.136966
H  -2.088975 1.679619 -0.120141
H  1.51346 -1.338573 0.140056
H  3.001612 1.413297 -0.146463
H  3.978874 -1.518171 0.135223
H  -4.63058 1.527246 0.809476
H  -4.656307 1.337465 -0.960186
H  -5.543371 0.159823 0.07375
H  6.029202 -0.310838 -0.895665
H  5.474341 1.223744 -0.155529
H  6.045704 -0.130769 0.868672
