program: Gaussian 09
title: 000009712
version: EM64L-G09RevD.01
frameworkgroup: C1[X(C6H5F3Si)]
method: RPBEPBE
basis: SDD
operation: Freq
keyword: #p
keyword: freq=noraman
keyword: PBEPBE/SDD
title: #p freq=noraman PBEPBE/SDD
converged: YES YES NO YES
title: Mulliken charges:
elementType: Si F F F C C C C C C H H H H H
charge: 1.597894 -0.434101 -0.441135 -0.441144 -0.361355 -0.255260 -0.255227 -0.213032 -0.213051 -0.214844 0.253446 0.253410 0.241806 0.241805 0.240788
chargesum: 0.00000
title: Mulliken charges with hydrogens summed into heavy atoms:
elementType: Si F F F C C C C C C
charge: 1.597894 -0.434101 -0.441135 -0.441144 -0.361355 -0.001814 -0.001817 0.028774 0.028754 0.025944
polarizability: 1.05816067e+02 -1.09369147e-03 8.55056990e+01 2.56994281e-01 -2.74100048e-04 4.18949778e+01
1716.lowfreq: -11.9844 -3.6399 -0.0009 0.0012 0.0020 10.2979 21.6744 90.7042 106.0315
frequency: 19.9822 90.7026 105.9296 198.3585 225.7147 236.6265 287.7419 334.3330 389.0683 420.2095 472.1188 611.1732 652.7975 699.3016 745.2687 772.6785 832.1856 846.9298 854.6511 926.8426 978.8043 985.6228 1008.0800 1025.5831 1083.4495 1119.7265 1179.5748 1203.4002 1318.3081 1375.3719 1423.1468 1473.4547 1582.2331 1601.4103 3132.4553 3136.2079 3145.0238 3158.7981 3171.9404
redmass: 5.4063 7.8299 8.0632 8.6981 11.4438 10.6004 8.9410 9.7940 2.7558 14.8718 3.8769 6.4743 8.4853 1.9800 1.6081 11.4148 21.2449 10.3866 1.3329 1.3259 1.4018 6.2455 1.3344 2.7340 1.6965 3.1311 1.0567 1.1280 1.3663 5.9119 2.1392 2.0201 5.5833 5.7455 1.0859 1.0889 1.0927 1.0967 1.1019
irintensity: 0.0010 0.4027 1.9617 0.3147 3.8756 28.5319 20.9127 14.0528 0.0019 77.3943 24.0585 0.0184 21.4157 49.9059 71.5191 167.5993 136.9345 115.8883 7.0664 0.4367 0.0001 0.8140 0.0008 0.0048 0.8888 81.1328 0.2133 1.6715 3.8219 0.0227 23.7396 1.8840 0.0420 7.3662 0.0349 0.0716 5.3083 21.5829 15.7181
temp: 298.150 k
press: 1.00000 atm
elementType: 14 9 9 9 6 6 6 6 6 6 1 1 1 1 1
symmnumber: 1
zpe: 256151.6 jmol-1
zpe.correction: 0.097563 hartree
zpe.thermalcorrener: 0.107132 hartree
zpe.thermalcorrenthalpy: 0.108077 hartree
zpe.thermalcorrgfe: 0.060966 hartree
zpe.sumelectzpe: -819.971494 hartree
zpe.sumelectthermal: -819.961924 hartree
zpe.sumelectthermalent: -819.960980 hartree
zpe.sumelectthermalfe: -820.008091 hartree
dipole: -5.1107 0.0000 0.0149
dipole: 5.1107
quadrupole: -61.9048 -59.1535 -69.8466
quadrupole: 0.0007 -0.2994 -0.0002
quadrupole: 1.7302 4.4815 -6.2117 0.0007 -0.2994 -0.0002
hfenergy: -820.0690566 hartree
pointgroup: C01 [X(C6H5F3Si1)]
dipole: -2.0106826 -0.0002777 -0.0104467 debye
dipolederiv: 2.6796225 0.0001782 0.0017019 0.0000805 1.6603382 0.0000028 0.0352352 0.0000072 1.8375874 -0.7791036 0.0000433 -0.1135881 0.0001289 -0.4432476 0.0001363 -0.1750103 0.0001037 -0.651352 -0.7550581 0.101831 0.0513183 0.161807 -0.5769271 -0.0906098 0.0694408 -0.0811906 -0.5158287 -0.754928 -0.101991 0.0511356 -0.161937 -0.5772981 0.0904671 0.06917 0.0810772 -0.5155294 -0.4631034 -0.0000398 0.0098001 -0.0000367 -0.2600933 0.0000017 0.0290267 0.0000065 -0.3493222 0.0175224 0.1726977 -0.0013328 -0.1317425 0.0545688 -0.0025631 -0.0161881 -0.0080164 -0.1056384 0.0175518 -0.1727281 -0.0013504 0.131682 0.054605 0.0025798 -0.0162052 0.0080301 -0.1056269 -0.1002335 -0.173504 0.0014157 -0.0991766 0.0463482 -0.0026975 -0.0003701 -0.0024119 -0.127792 -0.1003368 0.1734424 0.0014287 0.0991444 0.0464268 0.0027117 -0.0003601 0.0024233 -0.1277855 0.1738949 0.0000279 0.000273 0.000012 0.0159985 0.0000042 0.0006908 0.0000044 -0.126493 0.0596765 -0.0774331 0.0000452 -0.0579449 -0.0088818 0.0009396 0.0021286 0.0028729 0.1506995 0.0595811 0.077483 0.0000545 0.0579903 -0.0088732 -0.0009542 0.0021486 -0.00289 0.1506924 0.0253625 0.0773059 -0.0000444 0.0856296 -0.0484486 0.001489 0.0008985 0.0018339 0.1655489 0.0254158 -0.0772819 -0.00005 -0.0856054 -0.0484992 -0.0015047 0.0008925 -0.0018482 0.1655471 -0.1058642 -0.0000317 -0.0008073 -0.0000317 0.0939834 -0.0000028 -0.0014977 -0.0000021 0.155293 unknown
polarizability: 105.807692|0.0017925|85.5056991|0.7754573|0.0017977|41.9033531 unknown
InChI: InChI=1S/C6H5F3Si/c7-10(8,9)6-4-2-1-3-5-6/h1-5H
charge 0 multiplicity 1
15 atoms
Si 1.784374 0.000277 0.014872
F  2.505548 -0.000913 1.544831
F  2.405521 -1.367819 -0.757189
F  2.404969 1.369865 -0.75496
C  -0.073326 -0.000001 0.004598
C  -0.785857 1.229354 0.000154
C  -0.785468 -1.229582 0.000071
C  -2.197787 1.225247 -0.003377
C  -2.197397 -1.225929 -0.003471
C  -2.903004 -0.000453 -0.00208
H  -0.24889 2.184761 -0.01155
H  -0.248202 -2.184821 -0.01172
H  -2.743577 2.174491 -0.008681
H  -2.742883 -2.175348 -0.008846
H  -3.99852 -0.000628 -0.004952
