program: Gaussian 09
title: 000086683
version: EM64L-G09RevD.01
frameworkgroup: C1[X(C16H35N)]
method: RPBEPBE
basis: SDD
operation: Freq
keyword: #pfreq=noraman
keyword: PBEPBE/SDD
title: #p freq=noraman PBEPBE/SDD
converged: YES YES NO NO
title: Mulliken charges:
elementType: N C C C C C C C C C C C C C C C C H H H H H H H H H H H H H H H H H H H H H H H H H H H H H H H H H H H
charge: -0.113984 0.031907 -0.437430 -0.414029 -0.418470 -0.365402 -0.345135 -0.374604 -0.362856 -0.359164 -0.350999 -0.718222 -0.329511 -0.340353 -0.703066 -0.702479 -0.695496 0.179595 0.201829 0.191449 0.209232 0.185339 0.204248 0.202510 0.193299 0.192278 0.198553 0.175747 0.183586 0.203138 0.186951 0.187497 0.184483 0.202407 0.199894 0.193296 0.209085 0.215955 0.212504 0.220234 0.183145 0.191283 0.191194 0.209248 0.215331 0.207617 0.212977 0.214207 0.204825 0.212162 0.214515 0.209678
chargesum: 0.00000
title: Mulliken charges with hydrogens summed into heavy atoms:
elementType: N C C C C C C C C C C C C C C C C
charge: -0.113984 0.211502 -0.044151 -0.019459 -0.011712 0.020175 0.029165 0.012121 0.011592 0.027727 0.042192 -0.080677 0.073867 0.042124 -0.070870 -0.070470 -0.059141
polarizability: 2.00388335e+02 3.38747312e+00 1.90898940e+02 1.01431876e+00 1.32386755e+00 1.58637829e+02
1716.lowfreq: -8.4947 -0.0005 -0.0003 0.0002 4.7442 6.2521 14.1017 27.4634 32.8052
frequency: 12.2552 27.2150 32.7342 41.9955 48.0089 62.0794 65.5393 74.1093 90.8510 94.5097 111.7354 122.5492 132.9936 150.0953 164.1476 203.6521 220.7695 230.8826 233.3592 236.9378 250.7380 276.4011 291.4827 301.0879 321.3776 329.1947 361.5690 399.9317 432.3276 441.3012 495.4251 541.3741 577.7141 724.8336 726.5703 733.1033 759.8726 771.7985 781.4713 800.2484 819.8712 827.2644 870.9725 885.7421 897.7546 902.5249 920.0332 925.6111 944.2198 968.0563 972.3837 1003.0244 1019.6543 1041.4208 1049.1205 1054.6742 1055.2895 1067.4510 1079.0252 1082.8406 1094.9212 1107.8438 1113.0170 1127.2042 1141.8042 1152.8207 1178.6916 1186.4490 1218.7566 1223.1176 1235.9767 1240.4818 1245.2372 1261.3930 1265.9510 1274.6360 1279.8308 1283.4159 1284.1050 1287.1831 1294.7952 1304.0150 1306.9294 1327.7583 1332.1195 1341.2805 1347.4450 1353.3602 1360.4937 1364.6517 1369.7658 1376.3369 1386.1137 1387.8362 1389.5381 1391.9216 1453.5631 1457.7261 1462.7889 1463.9813 1467.8045 1470.2541 1470.7152 1471.1658 1473.5519 1476.2147 1477.1502 1477.4933 1478.3200 1479.6890 1480.2453 1484.8143 1486.7156 1486.9101 1488.8791 2838.6921 2849.6061 2866.5269 2945.4086 2957.7974 2961.4666 2963.1984 2963.5358 2964.2778 2967.2221 2969.1828 2970.1121 2971.1491 2972.2429 2972.9415 2975.7267 2995.2052 3002.3927 3004.2600 3013.0717 3015.8662 3016.1832 3021.7460 3028.4195 3035.0867 3037.9770 3044.0166 3063.4103 3065.3359 3066.8826 3067.2249 3068.5430 3069.6051 3069.8952 3071.2546
redmass: 3.3127 2.7421 3.0644 2.4481 2.4203 2.5557 1.6143 1.8400 2.5184 2.0301 2.3105 2.2813 2.7601 2.2807 2.2589 1.9577 1.4545 1.2346 1.1354 1.1669 2.5909 2.6902 1.9778 2.7575 2.6222 2.6501 2.1679 2.7264 2.4767 2.5497 2.7682 2.7626 2.9398 1.1149 1.1837 1.1123 1.3359 1.3936 1.3367 1.4849 1.8645 2.1140 1.5584 1.8284 1.7350 1.5228 1.4968 1.2524 1.3874 1.6697 1.9514 2.1721 3.0476 2.7718 2.4900 1.8192 1.7350 2.4652 2.2181 2.0215 1.9398 2.0510 1.9846 2.1605 2.3230 2.1530 2.2577 2.0917 1.3793 1.3721 1.3642 1.3983 1.2860 1.3547 1.3173 1.2752 1.1744 1.0886 1.1196 1.1230 1.1753 1.2816 1.2244 1.3560 1.4771 1.5037 1.5336 1.6189 1.5017 1.3264 1.3629 1.4237 1.2155 1.2195 1.2216 1.2124 1.0766 1.0806 1.0729 1.0742 1.0679 1.0713 1.0789 1.0762 1.0672 1.0437 1.0437 1.0550 1.0438 1.0616 1.0646 1.0609 1.0772 1.0846 1.0872 1.0714 1.0714 1.0706 1.0742 1.0584 1.0586 1.0551 1.0622 1.0619 1.0410 1.0366 1.0633 1.0636 1.0383 1.0372 1.0590 1.0967 1.0975 1.0936 1.1001 1.1001 1.0885 1.0899 1.0889 1.1005 1.1006 1.1014 1.1006 1.1006 1.0997 1.0991 1.0993 1.1005 1.0993 1.0995
irintensity: 0.0071 0.0006 0.0088 0.0076 0.0418 0.0091 0.0327 0.0595 0.0138 0.2103 0.1486 0.0754 0.3969 0.3058 0.1476 0.4296 0.0334 0.0842 0.0596 0.0591 0.2261 0.5522 1.8641 0.3095 0.4666 2.5401 0.5234 1.0579 0.4667 1.8215 4.4300 4.1159 1.4730 14.3576 7.4196 9.9650 11.8462 2.9981 0.5650 4.5472 0.1378 0.5322 3.0928 5.0776 12.0052 1.2565 7.3860 11.1540 8.1736 8.6284 0.8253 2.9856 2.4713 2.4666 10.0248 4.1800 2.0301 15.1805 17.5486 4.0852 24.9768 8.2406 2.9583 1.0536 7.9943 7.7179 6.9525 12.6894 1.0081 1.9800 1.8566 4.8950 4.7713 5.6050 5.2516 6.3982 0.4966 1.3902 0.3922 0.4814 4.7964 1.4287 9.5777 0.7134 4.6612 0.8162 1.0075 0.8884 5.3505 4.7603 3.1038 5.3869 7.0421 17.1692 6.8962 13.9461 3.2988 3.3853 0.7743 0.7420 3.7789 1.4870 7.6338 1.6858 3.7534 21.1699 8.6425 7.1492 1.3769 6.8814 5.9075 6.6278 5.4801 36.3531 15.9281 45.1337 80.8741 187.6591 12.2117 8.8772 22.9841 14.9819 13.6720 32.7649 41.5535 33.8710 58.5401 120.8149 16.0783 32.8988 59.8727 1.6022 6.2924 13.5110 19.4865 1.9683 5.9064 24.7806 55.3785 74.4053 36.2540 54.8836 185.2495 18.4176 46.8160 39.4406 64.3475 80.5964 89.6709 58.4284
temp: 298.150 k
press: 1.00000 atm
elementType: 7 6 6 6 6 6 6 6 6 6 6 6 6 6 6 6 6 1 1 1 1 1 1 1 1 1 1 1 1 1 1 1 1 1 1 1 1 1 1 1 1 1 1 1 1 1 1 1 1 1 1 1
symmnumber: 1
zpe: 1260695.4 jmol-1
zpe.correction: 0.480174 hartree
zpe.thermalcorrener: 0.503685 hartree
zpe.thermalcorrenthalpy: 0.504629 hartree
zpe.thermalcorrgfe: 0.424212 hartree
zpe.sumelectzpe: -683.981160 hartree
zpe.sumelectthermal: -683.957649 hartree
zpe.sumelectthermalent: -683.956705 hartree
zpe.sumelectthermalfe: -684.037122 hartree
dipole: 0.4873 0.4345 0.5116
dipole: 0.8295
quadrupole: -112.4715 -112.3446 -111.6148
quadrupole: -1.1797 0.6319 -1.5764
quadrupole: -0.3279 -0.2009 0.5289 -1.1797 0.6319 -1.5764
hfenergy: -684.4613337 hartree
pointgroup: C01 [X(C16H35N1)]
dipole: -0.1801695 0.1861184 -0.1984878 debye
polarizability: 199.98343|-3.8813993|191.3282351|1.3363052|-0.5352526|158.6134386 unknown
InChI: InChI=1S/C16H35N/c1-5-9-12-16(8-4)15-17(13-10-6-2)14-11-7-3/h16H,5-15H2,1-4H3
charge 0 multiplicity 1
52 atoms
N  -0.897707 0.07622 -0.766205
C  0.708987 1.777941 0.229993
C  0.141942 1.1038 -1.049723
C  1.499224 0.768686 1.110191
C  1.54507 3.041528 -0.122015
C  -0.966019 -0.973586 -1.820392
C  -2.227802 0.67429 -0.472441
C  2.86075 0.298247 0.545101
C  0.142558 -2.043687 -1.698342
C  -3.104482 -0.209568 0.439847
C  3.541525 -0.756471 1.448317
C  0.694923 4.266314 -0.529835
C  0.017385 -2.911704 -0.42693
C  -4.503757 0.398483 0.689946
C  4.900402 -1.23945 0.896932
C  1.179719 -3.914936 -0.268634
C  -5.379117 -0.476242 1.613177
H  -0.155588 2.119676 0.839964
H  0.975004 0.612147 -1.585528
H  -0.252941 1.88819 -1.743155
H  0.850543 -0.114866 1.273591
H  1.674271 1.229013 2.105499
H  2.161752 3.313233 0.758789
H  2.260265 2.800495 -0.934916
H  -1.946665 -1.479746 -1.735739
H  -0.933896 -0.516873 -2.842728
H  -2.064957 1.644258 0.034564
H  -2.787362 0.905257 -1.416478
H  2.726155 -0.13694 -0.466788
H  3.5438 1.163624 0.424429
H  0.104405 -2.692342 -2.598763
H  1.139019 -1.556442 -1.710536
H  -3.220967 -1.217821 -0.006777
H  -2.575347 -0.355111 1.402074
H  2.859174 -1.62292 1.568494
H  3.681639 -0.329988 2.462934
H  0.008943 4.558093 0.288184
H  1.334206 5.138759 -0.760187
H  0.079621 4.05955 -1.424939
H  -0.032732 -2.239157 0.450279
H  -0.946715 -3.460917 -0.456433
H  -4.391189 1.408656 1.135001
H  -5.019836 0.5438 -0.281572
H  5.60873 -0.395649 0.792764
H  5.365149 -1.990854 1.561837
H  4.781247 -1.700453 -0.102321
H  2.149874 -3.386941 -0.191181
H  1.059877 -4.533714 0.639999
H  1.240023 -4.598356 -1.13735
H  -4.899543 -0.61228 2.600795
H  -6.37358 -0.022451 1.779361
H  -5.534282 -1.480795 1.176049
