program: Gaussian 09
title: 000086578
version: EM64L-G09RevD.01
frameworkgroup: C1[X(C7H14N2O2)]
method: RPBEPBE
basis: SDD
operation: Freq
keyword: #p
keyword: freq=noraman
keyword: PBEPBE/SDD
title: #p freq=noraman PBEPBE/SDD
converged: NO YES NO NO
title: Mulliken charges:
elementType: O O N N C C C C C C C H H H H H H H H H H H H H H
charge: -0.276975 -0.304047 -0.367386 -0.363491 0.248102 -0.084033 -0.405882 -0.718287 -0.720417 0.169896 -0.514223 0.231486 0.248249 0.215164 0.249793 0.212804 0.208447 0.255123 0.205763 0.202240 0.324618 0.324939 0.197752 0.223048 0.237318
chargesum: 0.00000
title: Mulliken charges with hydrogens summed into heavy atoms:
elementType: O O N N C C C C C C C
charge: -0.276975 -0.304047 -0.042769 -0.038552 0.248102 0.147453 0.057530 -0.047243 -0.057292 0.169896 0.143895
polarizability: 1.05068342e+02 -8.54815121e-01 9.46117987e+01 -1.58461573e+00 4.72019165e+00 8.04784481e+01
1716.lowfreq: -14.9978 -12.7769 -0.0008 0.0003 0.0006 8.7115 69.6468 99.7801 111.4427
frequency: 69.6127 99.7710 111.4053 170.7011 188.2324 200.7396 212.8029 219.3859 272.0338 312.0350 336.1988 354.5804 418.7828 459.7487 475.9209 501.4275 520.2321 576.3233 617.0991 708.1713 720.6787 801.4532 852.0370 881.3089 907.4146 942.6557 948.6423 1002.2577 1016.5532 1027.4499 1059.9321 1110.6532 1133.7129 1143.1355 1182.6316 1202.4795 1228.6349 1265.1872 1288.8888 1318.2146 1339.5806 1379.9272 1393.2586 1409.9232 1410.9943 1425.9860 1437.1430 1458.4579 1461.9849 1468.8651 1479.0159 1480.0041 1485.8318 1495.3962 1660.6747 2932.8396 2949.8636 2972.6324 2980.9723 2984.9553 3020.1318 3036.8239 3066.7862 3073.4076 3098.5013 3106.3512 3108.0721 3574.5917 3579.3025
redmass: 3.3151 5.0499 2.4652 1.1866 2.1827 1.3954 1.8917 1.3200 2.4325 2.7637 2.7378 3.2703 4.0766 3.6081 3.0732 2.2626 1.6696 1.1132 5.4414 4.5922 8.3335 5.5128 3.6059 2.4469 2.0499 2.1978 1.3773 1.5686 4.9797 1.9739 2.0109 1.2980 1.9613 1.6134 1.8182 2.3536 2.3445 2.2935 1.3580 1.4060 1.7349 1.2038 1.4035 1.3819 1.4792 1.2741 1.6770 1.0534 1.0943 1.0509 1.0659 1.0577 1.1422 1.1521 4.6147 1.0372 1.0842 1.0603 1.0370 1.0378 1.0993 1.1024 1.0993 1.0984 1.0985 1.0980 1.0982 1.0769 1.0778
irintensity: 2.0856 1.3615 6.2387 0.6029 3.5836 2.6641 0.0617 3.2438 5.7350 1.4884 3.8016 5.8917 6.0672 7.7981 5.9442 4.0651 5.7836 184.7241 11.6098 25.8083 39.4787 5.9642 26.4877 22.3035 11.6298 12.6574 3.2098 3.4499 145.8581 41.6417 24.7525 2.7000 74.7816 31.0782 1.0088 3.6374 51.0476 6.4306 64.1701 3.9551 13.4233 15.9876 7.8832 6.6773 37.5054 34.5541 58.1655 9.1317 14.0172 2.9317 15.6643 9.1270 23.2160 86.1345 461.1361 76.5115 64.6799 43.5097 19.3159 46.8381 53.9634 26.1687 5.5553 63.9236 21.8728 25.5782 17.6453 42.0430 20.7969
temp: 298.150 k
press: 1.00000 atm
elementType: 8 8 7 7 6 6 6 6 6 6 6 1 1 1 1 1 1 1 1 1 1 1 1 1 1
symmnumber: 1
zpe: 557049.5 jmol-1
zpe.correction: 0.212169 hartree
zpe.thermalcorrener: 0.224140 hartree
zpe.thermalcorrenthalpy: 0.225084 hartree
zpe.thermalcorrgfe: 0.175136 hartree
zpe.sumelectzpe: -534.221243 hartree
zpe.sumelectthermal: -534.209272 hartree
zpe.sumelectthermalent: -534.208328 hartree
zpe.sumelectthermalfe: -534.258276 hartree
dipole: 3.9153 0.0365 0.3833
dipole: 3.9342
quadrupole: -84.2308 -57.8646 -62.7120
quadrupole: 0.3695 3.1623 5.8541
quadrupole: -15.9617 10.4045 5.5572 0.3695 3.1623 5.8541
hfenergy: -534.4334121 hartree
pointgroup: C01 [X(C7H14N2O2)]
dipole: -1.5221665 0.2598072 -0.1063656 debye
dipolederiv: -0.5536257 -0.0377927 -0.0607276 0.0664375 -1.1673207 -0.1372582 0.1104194 -0.2861652 -0.4279009 -1.3975254 0.0666356 0.1280333 0.0608186 -0.5205156 0.0838332 0.1262676 0.1085449 -0.5071339 -0.9605405 0.5030045 -0.1556438 0.2655826 -0.7979272 0.0258477 -0.2906094 0.0498057 -0.5793148 -0.6852488 -0.1942528 0.2255739 -0.3140464 -0.6666038 0.1706826 0.2066448 0.1420056 -0.6553371 0.0580558 0.0193149 0.0318696 0.0177498 0.0503723 0.0108217 0.033675 0.0124222 0.0616906 0.8519073 -0.3985513 0.0279803 -0.1230777 0.8288789 0.2289805 -0.1394745 0.4840796 0.5290568 0.4693759 0.0481623 -0.1630345 -0.0074522 0.2422234 0.0760672 -0.0289173 0.0796158 0.173824 0.0007553 -0.0015495 0.0134399 0.0222704 -0.0267391 -0.0667558 0.0248158 -0.0438902 -0.0140041 -0.0398261 0.032735 0.034938 0.0065498 0.0394142 -0.0435827 0.0122668 -0.0464854 0.0311196 1.8428518 -0.1493683 -0.1173247 -0.0957821 1.0414237 -0.5937239 -0.06742 -0.7118655 0.8753751 0.2926316 0.1676935 0.0654791 0.0213713 0.6765409 -0.0326475 0.0510609 -0.1494196 0.2447058 -0.036278 0.0578367 -0.074881 0.0745359 -0.0366506 0.0700777 -0.0797805 -0.005046 -0.1626969 -0.0440369 -0.0215717 0.0594952 0.055545 0.0414401 -0.1398868 0.0507911 -0.0914786 -0.0791543 -0.0082047 -0.0611905 0.0491682 -0.079658 -0.136405 0.0932252 0.0401931 0.0435519 0.0727028 -0.0880948 0.0782877 0.0864465 0.0476901 0.0866857 -0.0118477 0.0599594 -0.0128781 0.0729639 0.0368907 -0.1086752 0.0174389 -0.1051356 -0.1037851 0.0227333 0.0523711 0.0797043 0.0522957 0.0306094 0.0305956 -0.1071999 0.0658143 0.048801 0.0929133 -0.100935 0.0319624 -0.0862659 0.1083479 0.0314738 -0.001682 0.0487532 0.0274871 -0.1047525 0.0343543 -0.1129123 -0.0228975 -0.0096013 0.0311583 -0.0629963 0.0602992 0.0735217 0.0635558 -0.1354798 0.0656626 -0.075187 0.0135525 -0.0586443 0.0263535 -0.1286212 -0.1192484 0.0829656 0.0533869 0.0681658 0.0706138 0.0970372 0.0107872 0.0189879 0.0110106 0.226576 0.0924613 -0.0169806 0.0895872 0.2603065 0.0864374 0.01256 0.009173 0.0025776 0.2765434 0.0689639 0.026182 0.0819466 0.2442865 0.0277098 0.003955 -0.0985228 -0.0022014 -0.0531239 0.0384292 -0.0908103 0.1885176 -0.141432 -0.1790379 -0.1086371 -0.006666 0.0055067 0.0166295 -0.0009582 0.0143465 0.0675583 0.0791443 0.0858577 0.0460332 0.0543014 0.0234619 -0.0482187 -0.0901447 0.0536725 -0.1329896 -0.0167611 unknown
polarizability: 104.9442008|-0.8514889|94.8178227|-2.9415846|-4.0314384|80.3965652 unknown
InChI: InChI=1S/C7H14N2O2/c1-7(2)4-8-6(10)9-5(7)11-3/h5,8-9H,4H2,1-3H3
charge 0 multiplicity 1
25 atoms
O  -0.752147 1.655544 0.483028
O  3.012367 -0.446349 -0.253178
N  0.930558 0.449619 -0.824682
N  1.09043 -1.22197 0.828646
C  -1.155407 -0.667329 -0.110438
C  -0.487911 0.658344 -0.579173
C  -0.352402 -1.153172 1.128118
C  -1.092917 -1.707359 -1.257412
C  -2.62557 -0.420473 0.297029
C  1.755664 -0.406238 -0.073649
C  -0.220368 2.985034 0.180114
H  -0.953573 1.019567 -1.522884
H  -0.546674 -0.458477 1.969806
H  -0.70246 -2.160607 1.420908
H  -0.055401 -1.950822 -1.541018
H  -1.593387 -2.642456 -0.945241
H  -1.617182 -1.331432 -2.156063
H  -2.696287 0.342325 1.088649
H  -3.216066 -0.069514 -0.569759
H  -3.085589 -1.359835 0.657481
H  1.430506 1.020348 -1.506057
H  1.698235 -1.821762 1.385955
H  -0.622431 3.37268 -0.78105
H  0.886913 2.983296 0.139864
H  -0.552502 3.63764 1.002405
