program: Gaussian 09
title: 000086669
version: EM64L-G09RevD.01
frameworkgroup: C1[X(C16H36N4O4)]
method: RPBEPBE
basis: SDD
operation: Freq
keyword: #p
keyword: freq=noraman
keyword: PBEPBE/SDD
title: #p freq=noraman PBEPBE/SDD
converged: YES YES NO NO
title: Mulliken charges:
elementType: O O O O N N N N C C C C C C C C C C C C C C C C H H H H H H H H H H H H H H H H H H H H H H H H H H H H H H H H H H H H
charge: -0.492313 -0.491853 -0.229760 -0.231292 -0.050774 -0.050160 -0.378679 -0.378578 -0.374752 -0.373812 -0.043692 -0.044677 -0.580004 -0.571812 -0.583317 -0.568532 -0.354775 -0.353985 -0.560540 -0.555006 0.309166 0.308739 -0.687202 -0.687153 0.288871 0.261259 0.289543 0.260145 0.237898 0.238506 0.363069 0.360840 0.314471 0.299902 0.263060 0.333844 0.299702 0.250508 0.263515 0.301044 0.315006 0.250136 0.299742 0.332412 0.218737 0.248891 0.250486 0.214607 0.266480 0.241528 0.233724 0.270174 0.245224 0.234944 0.253230 0.244993 0.234893 0.253382 0.395064 0.394932
chargesum: 2.00000
title: Mulliken charges with hydrogens summed into heavy atoms:
elementType: O O O O N N N N C C C C C C C C C C C C C C C C
charge: -0.097248 -0.096921 -0.229760 -0.231292 -0.050774 -0.050160 -0.015610 -0.017738 0.175378 0.175875 0.194205 0.193829 0.297429 0.312242 0.296248 0.313759 0.112853 0.111108 -0.052532 -0.051107 0.309166 0.308739 0.046196 0.046115
polarizability: 3.02339370e+02 1.08282254e+01 1.92541047e+02 -3.25000822e+00 2.87489244e+00 1.63364951e+02
1716.lowfreq: -13.7467 -9.3011 -4.4016 -0.0013 0.0007 0.0020 2.0953 14.3683 22.2861
frequency: -9.3509 14.1884 22.2501 29.0038 52.9865 61.8232 73.1633 80.6235 89.7963 90.4630 98.4295 114.4757 115.5248 127.8948 137.2323 164.3839 171.6717 193.5907 219.3450 221.6468 228.0113 239.5742 249.6884 255.3804 263.7734 277.9669 294.5081 296.0379 309.0245 322.3390 327.5373 335.8559 339.2841 346.2401 353.9171 358.7613 361.5429 364.1261 387.2886 417.0053 418.5023 431.9973 447.0732 455.2151 459.7040 463.2824 468.6314 537.3546 551.3821 597.0779 611.3865 692.8271 708.5873 728.7784 738.2414 746.0630 790.5372 815.7559 817.0989 846.1470 847.1912 869.9071 871.6406 903.4294 929.1602 933.4946 934.6243 944.0670 947.8572 952.9559 975.3517 977.9905 1037.4323 1042.4353 1051.5848 1052.5563 1069.6959 1075.7956 1076.4036 1081.4207 1103.2974 1103.8178 1113.3580 1122.3627 1122.7085 1155.5262 1159.1179 1162.3974 1170.7941 1207.9393 1208.9220 1228.9395 1229.7906 1244.4358 1245.2306 1246.8395 1251.3765 1292.0457 1300.7832 1301.2252 1302.7261 1316.9000 1323.0324 1323.4469 1349.8698 1350.2942 1352.9724 1365.7393 1379.9994 1380.6581 1402.2732 1402.5255 1403.4929 1403.7058 1426.3030 1426.6038 1437.6291 1440.8573 1443.2456 1445.0096 1453.4619 1453.9153 1457.3502 1457.9681 1469.5605 1469.5966 1471.5530 1473.7701 1473.9114 1477.6667 1478.4362 1483.8155 1484.5827 1485.2146 1501.3178 1502.0772 1633.0078 1636.1732 2972.4806 2976.2014 2978.9108 2980.8056 2989.8260 2993.0083 2993.4116 3001.0275 3021.6342 3022.6638 3026.8919 3028.0261 3028.8715 3029.8268 3033.1470 3033.7063 3052.3450 3076.0713 3088.5138 3088.8424 3100.1499 3100.6228 3107.3968 3107.5264 3150.8159 3152.5234 3157.8944 3159.2692 3162.5990 3164.2574 3167.5559 3167.6810 3528.6353 3534.2005 3585.5466 3585.9510
redmass: 3.8798 4.4973 4.0240 3.8442 4.0958 2.9622 3.1892 2.7895 4.1275 4.1195 3.9406 4.4003 3.3982 2.8854 2.4423 2.5505 2.3960 3.3601 1.1517 1.1714 2.6579 4.2901 1.5876 1.5020 1.5668 4.4741 1.4333 1.2500 2.0070 2.2786 2.1375 1.1777 1.3198 2.2092 1.7453 2.2747 1.8056 1.6353 2.6388 2.8010 2.8493 2.7858 2.6947 2.4633 2.2361 2.6165 2.8697 2.8944 2.8859 2.9410 2.9676 4.6121 3.5507 1.6318 4.2265 2.2717 1.5526 3.7045 3.5060 3.6287 3.6308 2.4074 2.3582 1.5952 3.7499 1.7143 1.8107 2.0692 2.0525 3.9644 2.8851 3.0279 3.5582 3.8336 2.0963 2.1744 2.1819 1.4016 1.4022 2.2229 1.9056 1.8761 1.5027 1.6478 1.6462 2.1176 1.7215 1.9865 1.7457 1.6150 1.6163 1.6661 1.7112 1.2990 1.3167 1.3397 1.4256 1.1302 1.1986 1.1944 1.1608 1.3410 1.2445 1.2558 1.2605 1.2713 1.4691 1.5472 1.3771 1.3778 1.1396 1.1414 1.1901 1.1927 1.1603 1.1601 1.0910 1.0931 1.0868 1.0839 1.0839 1.1104 1.2135 1.2330 1.0739 1.0763 1.0716 1.0512 1.0553 1.0646 1.0714 1.1100 1.0935 1.0949 1.0660 1.0670 6.7416 6.7582 1.0601 1.0598 1.0846 1.0845 1.0623 1.0371 1.0370 1.0604 1.0578 1.0575 1.0979 1.0304 1.0299 1.0994 1.0311 1.0310 1.1025 1.1037 1.0989 1.0989 1.1035 1.1038 1.1061 1.1064 1.1062 1.1061 1.1071 1.1070 1.1063 1.1064 1.1074 1.1070 1.0807 1.0809 1.0668 1.0668
irintensity: 4.3206 1.7286 0.6802 0.0712 0.8894 0.5994 0.2644 0.6505 13.3379 6.0029 16.3514 3.9795 3.3981 0.0892 4.3417 0.1577 0.2979 0.2637 2.2681 2.6307 14.7895 2.4203 0.8904 1.9593 0.7060 0.9835 3.0284 0.1162 3.4300 2.0196 26.9616 144.1083 113.8789 51.0819 11.2445 41.3815 3.7214 174.8756 12.2271 21.5880 16.2168 3.4929 0.3992 0.3005 2.8962 1.1282 0.5465 2.0147 5.7436 16.9993 6.2011 0.0250 1.4426 16.0819 0.0052 11.9021 0.3578 34.6341 7.8993 33.2944 38.5205 3.3959 7.3651 4.5516 46.5220 21.6940 17.6105 1.9876 17.3995 0.1599 4.2048 10.4791 0.6397 0.2418 21.8530 3.5891 0.8379 19.5868 19.6121 0.4869 97.8257 32.0559 104.5924 2.2811 27.0777 7.1104 5.2979 18.7272 125.0195 43.4581 22.6193 26.2417 4.4834 16.1066 23.4934 10.6166 92.0087 0.0217 6.4418 5.0898 2.9617 0.0397 25.7933 5.5292 80.6424 5.9278 50.8422 0.0952 51.5084 26.4055 25.1624 26.8668 13.4785 13.3167 64.2970 60.7435 17.2787 2.8231 6.6546 6.0959 41.6819 38.9327 119.4418 18.6617 16.8093 3.3955 0.9630 31.7913 35.4282 13.2165 16.0156 11.1102 9.6178 25.4607 80.4857 40.1760 131.6245 53.5272 10.5745 8.8001 28.9943 29.2173 0.9673 3.4760 3.4920 33.1885 3.6905 3.3281 0.9425 13.2412 12.3822 7.9849 2.3322 2.0496 0.0575 37.1245 10.1954 10.0347 4.9597 4.1521 12.4104 12.3257 7.7537 6.3338 4.7295 3.9774 0.1448 0.2671 19.5649 13.1779 37.6929 38.1124 36.3198 35.6990
temp: 298.150 k
press: 1.00000 atm
elementType: 8 8 8 8 7 7 7 7 6 6 6 6 6 6 6 6 6 6 6 6 6 6 6 6 1 1 1 1 1 1 1 1 1 1 1 1 1 1 1 1 1 1 1 1 1 1 1 1 1 1 1 1 1 1 1 1 1 1 1 1
symmnumber: 1
zpe: 1382688.1 jmol-1
zpe.correction: 0.526638 hartree
zpe.thermalcorrener: 0.556098 hartree
zpe.thermalcorrenthalpy: 0.557042 hartree
zpe.thermalcorrgfe: 0.466181 hartree
zpe.sumelectzpe: -1148.623166 hartree
zpe.sumelectthermal: -1148.593706 hartree
zpe.sumelectthermalent: -1148.592762 hartree
zpe.sumelectthermalfe: -1148.683623 hartree
dipole: -0.0734 0.0849 -0.7901
dipole: 0.7981
quadrupole: 306.6556 -134.3039 -131.9407
quadrupole: 29.3981 0.9593 0.8477
quadrupole: 293.1853 -147.7743 -145.4110 29.3981 0.9593 0.8477
hfenergy: -1149.1498039 hartree
pointgroup: C01 [X(C16H36N4O4)]
dipole: 0.0279113 -0.0146203 0.3123986 debye
polarizability: 302.4897772|-9.5443363|192.6060801|-4.4145692|1.6304767|163.1495105 unknown
InChI: InChI=1S/C16H36N4O4/c1-13(21)11-19(3,4)17-15(23)9-7-8-10-16(24)18-20(5,6)12-14(2)22/h13-14,17-18,21-22H,7-12H2,1-6H3
charge 2 multiplicity 1
60 atoms
O  -8.588328 -0.643274 -0.383377
O  8.502714 0.720494 -0.500269
O  -3.170501 -1.794978 -0.174918
O  3.16108 1.727789 0.583262
N  -5.695513 -0.386987 -0.064671
N  5.674087 0.366693 0.147207
N  -4.344316 0.21939 -0.028727
N  4.337399 -0.261795 0.252023
C  -6.697494 0.805694 0.027553
C  6.677525 -0.807286 -0.081485
C  -8.128942 0.453334 0.47848
C  8.15502 -0.502568 0.234331
C  -5.861214 -1.343371 1.126195
C  -5.893185 -1.150569 -1.391762
C  5.994938 1.124109 1.444524
C  5.698774 1.33542 -1.055045
C  -0.652645 -0.422332 0.299548
C  0.650394 0.353324 0.003233
C  -1.895785 0.320737 -0.248234
C  1.896318 -0.39229 0.544091
C  -3.15857 -0.537081 -0.146151
C  3.152782 0.475617 0.455201
C  -9.014148 1.707419 0.362648
C  9.016531 -1.708259 -0.182594
H  -6.712674 1.263755 -0.976245
H  -6.273833 1.510197 0.765258
H  6.561703 -1.100169 -1.138948
H  6.352012 -1.627683 0.582735
H  -8.116302 0.116597 1.535966
H  8.276745 -0.330274 1.324067
H  -4.334286 1.241382 -0.091068
H  4.320866 -1.268375 0.067568
H  -5.064705 -2.096363 1.061462
H  -6.850297 -1.814065 1.031236
H  -5.775925 -0.763368 2.056691
H  -6.946879 -1.461731 -1.422066
H  -5.200981 -2.003197 -1.397865
H  -5.668206 -0.457795 -2.216597
H  6.026067 0.40261 2.274008
H  6.966548 1.61833 1.301566
H  5.202768 1.867885 1.603138
H  5.367711 0.777125 -1.943544
H  5.009682 2.161669 -0.834571
H  6.739473 1.669422 -1.170031
H  -0.764059 -0.567923 1.391705
H  -0.620684 -1.430876 -0.152167
H  0.621016 1.358768 0.4621
H  0.758198 0.504874 -1.088816
H  -1.741455 0.550281 -1.32323
H  -2.029603 1.291213 0.268296
H  2.033285 -1.358199 0.019963
H  1.742253 -0.631992 1.616324
H  -9.092468 2.045309 -0.685397
H  -8.627715 2.539922 0.978012
H  -10.031796 1.485185 0.730098
H  8.961987 -1.879396 -1.271814
H  8.708515 -2.631943 0.339853
H  10.072673 -1.527334 0.085443
H  -9.569248 -0.75576 -0.313593
H  9.484695 0.83969 -0.536096
