program: Gaussian 09
title: 000086581
version: EM64L-G09RevD.01
frameworkgroup: C1[X(C19H14O2)]
method: RPBEPBE
basis: SDD
operation: Freq
keyword: #pfreq=noraman
keyword: PBEPBE/SDD
title: #p freq=noraman PBEPBE/SDD
converged: NO YES NO NO
title: Mulliken charges:
elementType: O O C C C C C C C C C C C C C C C C C C C H H H H H H H H H H H H H H
charge: -0.459789 -0.223726 -0.010648 0.211270 0.324875 0.120442 0.162893 0.098481 -0.731013 -0.130399 0.417326 -0.411493 -0.386198 -0.485628 -0.368744 -0.375644 -0.442898 -0.234160 -0.238089 -0.274685 -0.242463 0.255172 0.246641 0.236460 0.288237 0.283931 0.243862 0.344283 0.286065 0.319037 0.244427 0.232141 0.237277 0.230717 0.232038
chargesum: 0.00000
title: Mulliken charges with hydrogens summed into heavy atoms:
elementType: O O C C C C C C C C C C C C C C C C C C C
charge: -0.115506 -0.223726 -0.010648 0.211270 0.324875 0.120442 0.162893 0.098481 0.007260 -0.130399 0.417326 -0.123256 -0.102267 -0.241765 -0.082679 -0.056607 -0.198470 -0.002019 -0.000812 -0.043969 -0.010425
polarizability: 3.32104423e+02 1.38442234e+01 2.31912485e+02 -1.03193961e+00 2.08394541e+00 9.66170615e+01
1716.lowfreq: -7.0193 0.0005 0.0007 0.0008 6.4893 11.3296 44.6212 67.6389 108.3305
frequency: 44.6010 67.6255 108.3223 117.1347 159.1227 160.7064 197.1753 227.8564 249.7868 266.9929 289.1063 317.0290 323.4248 324.8179 355.8322 368.8110 380.1117 427.1667 435.0315 444.1092 489.3863 500.1837 525.7421 546.9387 552.3634 587.1372 618.8545 645.2473 654.2837 667.6757 715.6926 718.0447 767.2852 773.7530 775.5442 797.0671 829.0485 837.9957 866.1173 872.9265 884.8859 901.4704 910.7459 953.3637 976.0818 983.7449 988.0228 1005.0670 1007.5608 1009.1922 1026.7465 1037.4163 1042.3796 1069.9820 1101.1580 1115.8525 1153.0636 1169.8937 1172.7728 1180.4655 1190.9439 1221.1499 1239.0519 1272.7131 1277.5290 1283.9252 1306.7340 1344.9092 1389.2430 1393.2051 1401.7142 1417.3635 1422.9773 1439.7300 1454.0369 1461.7412 1471.9603 1474.5373 1509.7067 1547.0877 1566.9112 1596.5403 1606.8852 1612.9727 1626.1698 3004.6889 3108.3938 3114.1913 3124.2846 3131.2363 3132.5228 3137.8597 3147.9470 3159.2822 3159.7486 3166.5205 3169.9025 3188.7363 3554.7416
redmass: 5.7016 5.1486 4.2302 4.2048 4.6208 4.6558 3.7810 1.0959 3.8357 5.1206 4.3883 3.1687 3.7709 2.6968 2.5809 6.5558 2.9206 3.7709 4.8919 3.2079 5.6474 3.7674 6.7556 3.5721 5.4362 3.3923 6.3715 6.5296 6.4098 4.4214 4.6544 3.8910 1.4004 4.8287 1.6108 2.4489 2.2645 5.2224 1.8513 3.8135 3.1690 1.6319 1.5201 4.3548 1.6150 2.0674 1.5256 1.4142 1.3386 1.3677 2.3096 2.2749 2.2689 2.1839 1.8275 2.1833 1.3887 1.4577 1.1036 1.2782 1.9612 2.3083 1.7946 1.9235 1.7241 1.6695 3.0184 3.5427 1.2078 9.2028 3.4640 5.1209 2.9032 2.3106 2.1646 1.2711 1.0566 2.1296 3.8274 9.4732 8.0402 7.9712 6.2028 6.6622 6.5786 1.0344 1.1005 1.1007 1.0865 1.0891 1.0859 1.0909 1.0897 1.0983 1.0943 1.0957 1.1002 1.0946 1.0660
irintensity: 2.2841 0.3155 0.3846 0.9182 0.2138 0.5192 2.1786 1.1053 1.4456 0.1434 2.8730 7.5335 0.5525 14.0511 27.8727 3.2772 99.8668 9.0998 17.3035 9.6323 4.0847 1.8618 0.7047 15.8821 10.5921 0.2339 8.9024 0.6020 0.6171 3.2759 8.2021 12.0468 33.5029 3.4655 90.9336 0.2777 9.4904 7.9331 23.8418 13.6635 35.0059 10.1867 0.9973 23.8554 5.8320 35.7451 2.3367 1.7456 0.1326 0.2706 32.7259 18.5540 7.4207 26.5775 1.0720 2.1240 1.3637 23.1044 3.5689 0.4872 7.5571 36.4200 3.1452 43.2765 45.4953 37.2516 180.9080 86.1445 22.8197 5.2310 2.4982 5.6929 15.6759 19.3379 43.2671 20.1183 6.3172 3.8657 5.5506 123.7209 24.9618 36.6208 17.3185 25.6128 7.8423 12.2344 12.1184 16.1385 0.2771 7.3805 3.3796 22.8177 8.7407 33.7743 5.2043 16.1442 28.4861 12.9356 9.0597
temp: 298.150 k
press: 1.00000 atm
elementType: 8 8 6 6 6 6 6 6 6 6 6 6 6 6 6 6 6 6 6 6 6 1 1 1 1 1 1 1 1 1 1 1 1 1 1
symmnumber: 1
zpe: 714922.5 jmol-1
zpe.correction: 0.272300 hartree
zpe.thermalcorrener: 0.288395 hartree
zpe.thermalcorrenthalpy: 0.289339 hartree
zpe.thermalcorrgfe: 0.229856 hartree
zpe.sumelectzpe: -881.465439 hartree
zpe.sumelectthermal: -881.449344 hartree
zpe.sumelectthermalent: -881.448400 hartree
zpe.sumelectthermalfe: -881.507882 hartree
dipole: -0.9458 -2.6712 -0.5852
dipole: 2.8935
quadrupole: -100.1395 -124.3505 -122.8535
quadrupole: -8.7413 -1.1687 -0.6742
quadrupole: 15.6417 -8.5693 -7.0724 -8.7413 -1.1687 -0.6742
hfenergy: -881.7377384 hartree
pointgroup: C01 [X(C19H14O2)]
dipole: 0.3722832 1.0530482 -0.2200671 debye
polarizability: 332.079533|13.890708|231.9526921|1.9361392|-0.8888212|96.6017442 unknown
InChI: InChI=1S/C19H14O2/c1-19(21)16-9-5-4-8-14(16)18(20)15-11-10-12-6-2-3-7-13(12)17(15)19/h2-11,21H,1H3
charge 0 multiplicity 1
35 atoms
O  -0.201865 2.294664 -0.693908
O  -1.718292 -2.938301 0.169709
C  -0.49365 1.14388 0.211805
C  0.527552 0.001256 0.029991
C  -1.953284 0.730924 -0.017127
C  0.086856 -1.342282 0.0403
C  1.955373 0.271632 -0.035386
C  -2.364536 -0.62645 -0.009852
C  -0.370385 1.737171 1.643469
C  -1.360016 -1.718405 0.088636
C  2.881884 -0.847335 -0.083593
C  1.020054 -2.431917 -0.01233
C  -2.932586 1.744197 -0.172651
C  2.382189 -2.19195 -0.069833
C  -3.739646 -0.959537 -0.139894
C  2.520357 1.597611 -0.04869
C  4.292936 -0.607513 -0.138263
C  -4.295369 1.409576 -0.308525
C  -4.704261 0.051638 -0.284772
C  3.90193 1.799033 -0.0977
C  4.80218 0.691529 -0.142004
H  0.663645 2.05724 1.847673
H  -1.039902 2.60872 1.735781
H  -0.662721 0.984204 2.394208
H  0.606343 -3.444518 0.00072
H  -2.612095 2.790251 -0.197847
H  3.096766 -3.022365 -0.104206
H  -0.271816 1.975884 -1.630134
H  -4.012458 -2.019618 -0.129436
H  1.847184 2.456036 -0.056013
H  4.968973 -1.469823 -0.175755
H  -5.040459 2.20315 -0.433581
H  -5.763979 -0.205445 -0.385381
H  4.299056 2.819909 -0.109333
H  5.883045 0.864652 -0.181879
