program: Gaussian 09
title: 000086525
version: EM64L-G09RevD.01
frameworkgroup: C1[X(C10H14O2)]
method: RPBEPBE
basis: SDD
operation: Freq
keyword: #pfreq=noraman
keyword: PBEPBE/SDD
title: #p freq=noraman PBEPBE/SDD
converged: YES YES NO NO
title: Mulliken charges:
elementType: O O C C C C C C C C C C H H H H H H H H H H H H H H
charge: -0.443324 -0.205368 -0.219709 0.271805 -0.540893 0.188743 0.022626 -0.602409 -0.827889 -0.156006 -0.141780 -0.736935 0.225820 0.247946 0.274385 0.207043 0.241546 0.253045 0.230089 0.246250 0.345822 0.225453 0.225754 0.221261 0.219140 0.227584
chargesum: 0.00000
title: Mulliken charges with hydrogens summed into heavy atoms:
elementType: O O C C C C C C C C C C
charge: -0.097502 -0.205368 0.006111 0.271805 -0.018562 0.188743 0.022626 -0.153820 -0.098505 0.069447 0.083974 -0.068951
polarizability: 1.43877393e+02 -2.03411586e+01 1.16721971e+02 2.19582426e-01 8.89667080e-02 8.52606042e+01
1716.lowfreq: -21.2617 -7.7988 -3.7286 -0.0010 -0.0007 -0.0005 24.7316 39.9258 78.8288
frequency: 19.3409 39.7824 78.8199 94.3702 121.3954 143.6858 189.5983 206.6911 210.6416 241.3680 260.9672 295.5431 317.8852 341.7758 394.7793 491.3503 505.2527 543.8155 556.6251 609.7257 680.1291 698.0131 777.0507 830.5198 872.9082 917.2189 933.1384 971.5262 992.5899 1002.8482 1014.7533 1034.4277 1044.5905 1063.3557 1079.9684 1122.9028 1134.7955 1188.6514 1197.5577 1208.0619 1245.5679 1265.9405 1279.9108 1293.1811 1307.7198 1336.6178 1355.7233 1391.3839 1395.2571 1431.4237 1450.2871 1461.0968 1462.2481 1470.1550 1470.7437 1625.0989 1663.0234 1688.0541 2943.5250 2963.7684 2965.6965 2975.6977 3026.0744 3034.1588 3040.9252 3043.5355 3072.0518 3080.3995 3086.8332 3094.5424 3098.3874 3562.2136
redmass: 3.9164 3.5741 2.4914 2.6957 2.2800 1.0401 1.4630 2.8767 3.2875 2.5329 1.1842 2.0419 4.6035 3.0640 5.0910 2.6524 2.6869 3.8692 4.8005 3.8657 3.0191 3.4305 1.7524 2.4305 2.1823 1.9220 1.8593 1.0768 2.9102 2.0363 2.1176 1.9025 1.5457 2.7141 3.2121 2.1709 1.2523 1.8816 1.1866 1.6771 1.4294 1.3001 1.8849 1.2583 1.6270 2.1220 1.6336 1.2397 1.3283 1.0896 1.0981 1.0480 1.0606 1.0626 1.0579 11.2277 8.6882 6.1271 1.0839 1.0386 1.0362 1.0610 1.0617 1.0961 1.0971 1.0978 1.0959 1.0942 1.0969 1.1011 1.0913 1.0663
irintensity: 2.0837 1.0735 0.3023 1.9415 0.5518 6.6781 0.5010 17.5500 0.3160 38.7204 121.6485 2.3522 7.4627 9.3620 6.8760 1.2910 12.4971 3.0750 5.0971 6.1880 4.1964 2.3208 1.5863 0.6865 6.0135 36.7721 8.2774 54.4815 38.5623 45.4738 7.6998 10.0009 0.3311 8.0624 36.8209 2.7584 3.1758 18.6565 39.3816 7.3057 1.9457 0.9927 57.5599 3.0435 16.5363 29.6034 1.9675 12.7193 35.7510 18.7552 8.1570 18.4416 18.8054 23.3476 6.9539 232.0534 7.8997 1.3443 46.9662 28.7133 37.8841 32.8543 3.4918 17.1826 26.6194 4.7715 12.2903 8.6163 18.2192 10.4001 49.3573 7.4602
temp: 298.150 k
press: 1.00000 atm
elementType: 8 8 6 6 6 6 6 6 6 6 6 6 1 1 1 1 1 1 1 1 1 1 1 1 1 1
symmnumber: 1
zpe: 562302.7 jmol-1
zpe.correction: 0.214170 hartree
zpe.thermalcorrener: 0.227815 hartree
zpe.thermalcorrenthalpy: 0.228760 hartree
zpe.thermalcorrgfe: 0.172658 hartree
zpe.sumelectzpe: -538.957266 hartree
zpe.sumelectthermal: -538.943620 hartree
zpe.sumelectthermalent: -538.942676 hartree
zpe.sumelectthermalfe: -538.998777 hartree
dipole: 1.9815 -4.1457 -0.7979
dipole: 4.6637
quadrupole: -62.0147 -74.8953 -74.7136
quadrupole: -3.2530 -5.0912 1.1328
quadrupole: 8.5265 -4.3541 -4.1724 -3.2530 -5.0912 1.1328
hfenergy: -539.1714353 hartree
pointgroup: C01 [X(C10H14O2)]
dipole: -0.7085892 -1.6757971 0.2370432 debye
dipolederiv: -0.7031771 0.0737125 -0.1959387 0.1239723 -0.3038191 -0.1992071 -0.3993014 -0.2540113 -0.6180956 -0.6362058 -0.2612472 -0.1224052 -0.2522929 -0.97079 -0.1186966 -0.1278661 -0.0896396 -0.3827131 0.5479887 0.100629 0.0854899 -0.0218551 0.1964745 0.1525268 0.2537777 0.2151215 0.5907051 -0.0395281 0.2393817 0.0469756 0.2220523 0.4530433 -0.0089979 0.0349193 0.0626922 -0.1490064 -0.3008014 -0.0224418 -0.2107311 0.0013318 -0.0955988 0.0460348 -0.253593 0.0835834 -0.091701 0.2593366 -0.0796435 0.0152194 -0.1892491 -0.7434667 -0.0113948 0.1520752 0.0608825 -0.1150639 0.6802036 0.0664756 0.2994408 0.2594982 1.3358473 0.0827042 0.25084 -0.0989076 0.2878175 -0.1351614 -0.0034084 0.0400904 0.0372768 0.095618 -0.009961 0.1067633 -0.0614151 0.1318467 -0.0070535 -0.0326069 -0.0364677 0.0002829 -0.2446248 0.0092775 -0.0541356 -0.0731674 0.0436697 -0.0570584 0.088827 -0.0980589 0.0107524 -0.0305364 0.1897041 -0.3294009 0.1516841 -0.0644106 0.0427596 0.1137278 -0.1717711 0.1251629 0.0264368 0.1355211 -0.2048004 0.0888268 0.0570525 -0.064271 -0.008583 0.1320188 -0.1037268 0.0635399 0.0038033 0.1335285 -0.0232842 -0.012478 -0.169786 -0.0445167 0.0805041 -0.0323522 0.0327218 0.015545 0.0459439 -0.0285909 -0.1091889 -0.0068934 0.0829462 0.0251555 0.0616247 -0.015581 -0.0532148 0.0545558 -0.0776907 0.0899004 0.0898049 -0.012369 0.0254806 -0.0194576 0.105737 0.0111022 0.0112695 0.0353044 -0.0101177 -0.0009981 -0.0316942 0.0536188 0.018134 -0.0657587 0.140299 0.0549431 0.0871011 -0.0201755 0.0311237 -0.0291621 -0.043998 -0.054578 0.0115696 -0.127535 -0.0152394 -0.0370708 0.0309297 0.1155451 -0.0029729 -0.0072588 -0.0377663 0.019353 -0.0469954 -0.0102871 -0.08502 -0.0609545 -0.0981885 -0.0862265 0.0992845 -0.0531587 0.0352211 0.0066288 0.103161 0.0697382 0.0706653 -0.0212379 0.1016228 -0.0970711 0.0564234 0.0505511 0.0226053 -0.0759934 0.0795605 0.0479778 0.3621201 -0.1106486 0.0573423 -0.1565872 0.0832365 0.0484278 0.0945023 0.0960377 0.2562088 0.0594363 -0.0644578 0.0300207 -0.0273776 -0.0232623 -0.1293826 0.0626651 -0.1226626 0.0074034 0.094106 -0.0172474 0.0491283 -0.0210822 -0.0129003 -0.1244681 0.0446662 -0.1260927 -0.0048502 -0.1854465 0.0167803 -0.035911 0.0616296 0.1181133 -0.0204719 -0.0622964 0.016273 0.0385363 0.0743336 -0.0814378 -0.0402153 -0.0064357 -0.0707774 -0.1395821 0.0194872 -0.0845371 0.0134725 0.0690488 0.0045609 0.0200573 -0.0022216 -0.0503474 0.1257277 0.1098157 0.1152848 -0.0274301 unknown
polarizability: 142.0850023|21.3989205|118.4524422|1.1581409|1.4420408|85.3225241 unknown
InChI: InChI=1S/C10H14O2/c1-3-4-5-8-7(2)9(11)6-10(8)12/h3-4,9,11H,5-6H2,1-2H3
charge 0 multiplicity 1
26 atoms
O  -2.936908 -0.53984 -1.511638
O  0.128134 2.359282 0.642279
C  -2.482397 -0.069948 -0.184363
C  -1.294255 -0.877147 0.35379
C  -1.952287 1.368833 -0.320925
C  -0.234735 -0.067927 0.681904
C  -0.580094 1.351662 0.372879
C  1.121306 -0.436736 1.242037
C  -1.382575 -2.373755 0.457556
C  2.135664 -0.692395 0.132107
C  3.217511 0.091341 -0.11087
C  4.223548 -0.134453 -1.216563
H  -3.32866 -0.13036 0.534955
H  -2.610183 2.141832 0.10862
H  -1.818201 1.597479 -1.393837
H  1.036846 -1.332505 1.888953
H  1.476951 0.402026 1.868642
H  -1.383731 -2.833162 -0.55098
H  -2.320411 -2.689611 0.956172
H  -0.533774 -2.803396 1.014933
H  -3.437427 -1.388408 -1.405212
H  1.940353 -1.562821 -0.513514
H  3.379291 0.972405 0.528696
H  5.246538 -0.25476 -0.809511
H  3.981215 -1.034695 -1.809014
H  4.254782 0.732459 -1.905199
