program: Gaussian 09
title: 000086562
version: EM64L-G09RevD.01
frameworkgroup: C1[X(C15H17NO6)]
method: RPBEPBE
basis: SDD
operation: Freq
keyword: #p
keyword: freq=noraman
keyword: PBEPBE/SDD
title: #p freq=noraman PBEPBE/SDD
converged: YES YES NO NO
title: Mulliken charges:
elementType: O O O O O O N C C C C C C C C C C C C C C C H H H H H H H H H H H H H H H H H
charge: -0.265543 -0.259653 -0.232178 -0.248551 -0.362465 -0.301216 -0.412984 0.227435 0.150976 0.571002 -0.491290 -0.301096 -0.442976 -0.201888 -0.173160 -0.074166 0.239602 0.223411 -0.227129 -0.228480 -0.668938 -0.670767 0.266307 0.254828 0.246821 0.241003 0.241303 0.389528 0.275461 0.226930 0.226787 0.226163 0.226040 0.206435 0.230256 0.230320 0.205863 0.228004 0.228005
chargesum: 0.00000
title: Mulliken charges with hydrogens summed into heavy atoms:
elementType: O O O O O O N C C C C C C C C C C C C C C C
charge: -0.265543 -0.259653 -0.232178 -0.248551 -0.362465 -0.301216 -0.023457 0.227435 0.150976 0.571002 -0.224983 -0.046268 -0.196154 0.280419 0.102301 -0.074166 0.239602 0.223411 0.226587 0.223723 -0.001927 -0.008895
polarizability: 3.99573721e+02 4.79437984e-01 2.03390059e+02 5.01258477e-02 -1.96735861e-01 9.76735907e+01
1716.lowfreq: -42.8614 -4.8017 -0.0010 -0.0008 -0.0005 2.4445 3.2493 4.6128 18.2733
frequency: -42.8429 1.0278 18.1952 29.7524 47.2758 54.2212 60.8682 77.4729 95.2514 98.3904 123.8506 129.8216 175.8854 177.5687 210.6254 220.1358 235.7934 242.7235 275.7325 278.9332 330.3543 353.4731 368.4045 375.2446 397.4480 401.6575 428.2016 446.0711 494.2913 506.2617 598.0500 607.9911 644.0626 679.9951 683.3016 708.8846 727.9654 744.4163 772.7314 790.1692 798.3091 798.8043 804.1378 804.7127 826.6974 842.0488 851.0478 881.3517 919.5035 932.4259 943.3082 979.8004 1016.7989 1017.3334 1022.2834 1044.0846 1061.6687 1065.3433 1110.4577 1112.7236 1119.3119 1131.8132 1132.9805 1134.4526 1180.6059 1194.2737 1242.6534 1245.4494 1245.9960 1261.8135 1271.2291 1321.7063 1347.0788 1352.3069 1364.8614 1373.6626 1384.8188 1397.6490 1401.2168 1426.3512 1459.6185 1460.4784 1461.6951 1470.2969 1473.4014 1484.3473 1484.7422 1487.7600 1492.5821 1548.6664 1557.8728 1613.5880 1633.5023 1641.4100 2994.6866 2995.7437 3007.4637 3008.8484 3016.2670 3065.0856 3067.6485 3091.1024 3092.2973 3095.3854 3106.3120 3108.3340 3124.7490 3148.0727 3161.8679 3186.1846 3188.5794
redmass: 2.3802 3.7869 4.6479 3.9022 5.5354 2.8172 3.2597 3.5260 2.8318 7.8675 2.2513 4.9099 5.8715 4.7065 6.0301 3.3760 1.7317 1.2811 4.1389 5.0908 6.0040 5.3432 3.7658 4.5302 4.8775 3.2442 3.5700 11.4726 5.6204 7.1737 5.9785 4.0867 6.1956 9.8659 10.8778 3.8099 8.1125 7.4217 6.9171 5.9603 1.1009 1.1040 1.3974 4.9713 3.7829 9.8984 1.5902 4.8201 1.3528 3.7977 1.5321 4.9446 2.3426 1.0926 2.3663 6.3365 4.1904 1.4552 2.2459 2.2512 1.0364 1.5437 1.4501 1.4595 2.1866 3.0993 2.2198 1.1384 1.1410 4.8595 1.3756 1.7785 1.6742 1.8140 1.3459 2.0316 2.7783 1.2972 1.3351 5.7413 1.0404 4.1706 1.0403 1.0598 1.0661 1.3880 1.0816 1.0744 2.3431 3.9529 8.0768 7.6473 8.0760 3.2440 1.0357 1.0359 1.0580 1.0580 1.0534 1.1064 1.1066 1.0987 1.0985 1.1191 1.1023 1.1024 1.0841 1.0905 1.0888 1.0940 1.0942
irintensity: 14.9183 0.2223 0.8616 0.4706 0.4598 0.0527 0.3818 0.5908 3.0597 3.8201 0.1740 1.7293 1.7113 2.2867 0.4685 0.2531 1.2093 0.2030 1.7284 16.9064 7.3776 1.7944 18.4927 5.3750 8.8229 5.4988 1.6300 2.0811 0.7710 60.0785 4.1844 6.9409 0.0405 0.1923 0.6111 0.9230 0.0810 26.1796 23.6808 9.5435 0.7985 4.5514 27.6136 1.1302 0.2008 26.4376 40.3613 46.5161 8.0846 2.8318 11.8012 204.7453 9.6534 109.0752 83.4078 239.4484 4.2231 4.1962 1.2215 11.3189 0.0024 5.8288 4.7760 6.0057 142.6695 1186.9628 402.8517 0.0182 0.0767 50.5222 93.8681 134.9474 4.8510 106.7905 3.3998 4.9203 337.6512 12.3275 8.4129 214.8459 2.6894 52.3200 21.2891 5.8584 6.4248 40.1165 23.8561 0.1127 139.0629 241.3446 223.8641 108.0338 9.2313 788.9342 20.1964 33.6520 28.5143 17.8087 146.5664 9.2149 9.5076 57.9242 12.3962 30.3416 40.8937 49.6995 154.4471 9.2476 24.6549 3.1452 1.7659
temp: 298.150 k
press: 1.00000 atm
elementType: 8 8 8 8 8 8 7 6 6 6 6 6 6 6 6 6 6 6 6 6 6 6 1 1 1 1 1 1 1 1 1 1 1 1 1 1 1 1 1
symmnumber: 1
zpe: 787765.8 jmol-1
zpe.correction: 0.300044 hartree
zpe.thermalcorrener: 0.321412 hartree
zpe.thermalcorrenthalpy: 0.322356 hartree
zpe.thermalcorrgfe: 0.243429 hartree
zpe.sumelectzpe: -1086.245309 hartree
zpe.sumelectthermal: -1086.223941 hartree
zpe.sumelectthermalent: -1086.222997 hartree
zpe.sumelectthermalfe: -1086.301924 hartree
dipole: -0.5849 1.2913 -0.0185
dipole: 1.4177
quadrupole: -94.9188 -125.5422 -129.1454
quadrupole: 6.0977 0.0603 0.0690
quadrupole: 21.6167 -9.0068 -12.6099 6.0977 0.0603 0.0690
hfenergy: -1086.5453531 hartree
pointgroup: C01 [X(C15H17N1O6)]
dipole: 0.2280202 0.5087636 -0.0170112 debye
polarizability: 399.5668177|0.2745484|203.1893901|-1.5173586|-4.5988802|97.881163 unknown
InChI: InChI=1S/C15H17NO6/c1-3-19-14(17)11(15(18)20-4-2)8-16-10-5-6-12-13(7-10)22-9-21-12/h5-8,16H,3-4,9H2,1-2H3
charge 0 multiplicity 1
39 atoms
O  4.980117 -1.761891 0.044659
O  6.209969 0.302805 -0.048091
O  -3.623701 1.229003 -0.044232
O  -3.807076 -1.421738 0.087633
O  -1.503681 2.160582 -0.085379
O  -1.842124 -2.660235 0.121251
N  0.601449 0.629095 -0.028261
C  4.093794 -0.661172 0.005606
C  4.815483 0.551429 -0.048785
C  2.018588 0.542544 -0.032388
C  2.70191 -0.711647 0.01568
C  4.161556 1.783425 -0.096183
C  2.743042 1.763157 -0.0871
C  6.349781 -1.177355 0.018356
C  -0.287747 -0.391966 0.019419
C  -1.689968 -0.243805 0.018829
C  -2.247456 1.111811 -0.039305
C  -2.420984 -1.533303 0.078921
C  -4.157355 2.625712 -0.1046
C  -4.550656 -2.715903 0.149303
C  -5.677377 2.501207 -0.094049
C  -6.033812 -2.358758 0.147657
H  2.182729 -1.671032 0.058382
H  4.716396 2.723374 -0.138717
H  2.193586 2.709788 -0.123328
H  6.872151 -1.448217 0.951868
H  6.872059 -1.530733 -0.886955
H  0.136559 1.567228 -0.066008
H  0.084609 -1.420144 0.062183
H  -3.769149 3.187501 0.764183
H  -3.775058 3.107795 -1.022527
H  -4.259999 -3.331088 -0.721746
H  -4.243771 -3.255129 1.064044
H  -6.136275 3.506013 -0.137035
H  -6.029117 1.918022 -0.962042
H  -6.022978 1.997213 0.824506
H  -6.642673 -3.280297 0.194792
H  -6.285615 -1.727704 1.01713
H  -6.303006 -1.807385 -0.769472
