program: Gaussian 09
title: 000086522
version: EM64L-G09RevD.01
frameworkgroup: C1[X(C15H14ClNO3)]
method: RPBEPBE
basis: SDD
operation: Freq
keyword: #p
keyword: freq=noraman
keyword: PBEPBE/SDD
title: #p freq=noraman PBEPBE/SDD
converged: YES YES NO NO
title: Mulliken charges:
elementType: Cl O O O N C C C C C C C C C C C C C C C H H H H H H H H H H H H H H
charge: -0.061946 -0.245355 -0.178469 -0.183012 -0.332792 -0.239524 -0.251529 -0.152618 -0.149108 -0.441216 -0.438672 0.093863 0.116161 0.414275 0.381271 -0.350940 -0.253465 -0.800525 -0.223387 -0.246071 0.273616 0.275613 0.281599 0.279786 0.248726 0.212352 0.212214 0.248325 0.250617 0.268571 0.253853 0.242105 0.237295 0.258387
chargesum: 0.00000
title: Mulliken charges with hydrogens summed into heavy atoms:
elementType: Cl O O O N C C C C C C C C C C C C C C C
charge: -0.061946 -0.245355 -0.178469 -0.183012 -0.332792 0.034092 0.024084 0.128981 0.130677 0.019862 0.021866 0.093863 0.116161 0.414275 0.381271 -0.100322 -0.253465 -0.035997 0.013908 0.012316
polarizability: 2.29372686e+02 4.33569532e-01 1.74308759e+02 -1.99788533e+00 -1.29578831e+00 1.24519770e+02
1716.lowfreq: -0.9003 0.0020 0.0025 0.0025 5.7596 9.2019 36.5416 40.4544 60.0782
frequency: 36.4996 40.4460 60.0761 73.8114 126.2011 135.4505 157.8430 164.2280 182.6612 215.7363 224.3820 249.1893 266.0103 297.1822 311.7202 354.9658 384.1416 463.9379 473.2455 497.3503 507.3658 532.8665 548.2418 575.6909 593.4882 620.5499 639.7425 667.5521 705.7605 759.5040 761.7329 782.8054 786.3005 791.2191 798.1879 802.2712 861.6423 880.0855 899.7638 900.8090 904.8299 927.0351 962.1407 969.2889 970.4977 981.2496 1015.2170 1031.8545 1034.3649 1041.0842 1050.2250 1074.4473 1109.0692 1137.2352 1164.5393 1168.7271 1178.0821 1185.6980 1199.8758 1202.8211 1217.1232 1223.9310 1232.8126 1236.7320 1240.6104 1276.4621 1282.5771 1290.9133 1311.8120 1340.7939 1366.8766 1406.1007 1430.7715 1455.2473 1462.3590 1473.7640 1478.8100 1481.4423 1573.8580 1607.4721 1635.0475 1697.5657 2989.8764 3022.7732 3035.4015 3065.0017 3074.2791 3077.9361 3083.0990 3104.4699 3105.9047 3125.9686 3133.0923 3150.1102 3167.5914 3181.1414
redmass: 7.0024 6.0616 5.3610 4.5886 9.0099 4.3012 1.2148 6.0314 3.9703 4.1120 6.5833 2.1177 4.5384 4.2060 4.9606 4.5050 8.0357 5.6209 5.6975 4.4481 3.2952 6.1376 5.6473 7.9831 4.6517 7.7172 6.8392 5.9964 2.6759 5.7923 2.9158 4.9757 2.3697 1.8963 4.8704 3.7429 2.0754 2.6524 3.8324 1.5176 3.1668 3.3627 3.2531 2.3626 1.5127 1.6933 1.7878 2.2494 1.7655 2.0174 2.0110 2.1307 1.4299 1.8806 2.2655 3.0714 1.8071 1.3065 1.2983 1.3597 2.1032 2.0884 1.5504 1.2506 1.4257 1.5901 1.5564 1.5397 1.4417 4.5432 8.4226 1.2220 2.3576 2.4884 1.0823 1.2339 1.0950 1.1158 6.2231 7.5050 12.2073 12.5031 1.0382 1.0592 1.0627 1.0856 1.0963 1.0875 1.1049 1.1048 1.0995 1.0892 1.0950 1.0869 1.0930 1.0999
irintensity: 0.0837 2.2909 1.0237 0.5727 4.2431 2.5406 0.9054 2.6544 0.8791 2.1069 1.3869 1.5599 2.4437 2.9370 5.2759 2.7945 7.8711 5.4949 11.5781 1.5424 0.2079 5.9275 9.6714 9.3252 7.2435 19.5649 0.7854 8.4711 14.7894 28.6365 31.9929 8.8031 28.4083 10.5187 3.7885 8.5357 20.2993 1.1091 3.6603 1.5022 3.4947 9.1277 9.3618 12.3547 1.5061 22.9947 55.5967 2.1545 4.1895 13.1149 1.4072 7.1998 11.4501 17.4932 80.6610 145.1906 77.7600 3.9229 0.4625 8.9308 0.5876 68.2454 5.2316 0.1469 0.3072 1.8303 1.7341 6.2375 11.8456 172.2200 14.2014 20.4723 32.1297 32.8347 4.6909 53.5169 11.6262 17.2463 33.3983 8.8187 466.8124 12.9938 5.6849 24.9618 39.5889 5.6533 5.0705 7.0683 0.1442 34.6883 6.5056 16.0716 4.4203 4.6695 4.3440 8.2542
temp: 298.150 k
press: 1.00000 atm
elementType: 17 8 8 8 7 6 6 6 6 6 6 6 6 6 6 6 6 6 6 6 1 1 1 1 1 1 1 1 1 1 1 1 1 1
symmnumber: 1
zpe: 684734.5 jmol-1
zpe.correction: 0.260802 hartree
zpe.thermalcorrener: 0.277477 hartree
zpe.thermalcorrenthalpy: 0.278421 hartree
zpe.thermalcorrgfe: 0.215715 hartree
zpe.sumelectzpe: -1319.060810 hartree
zpe.sumelectthermal: -1319.044135 hartree
zpe.sumelectthermalent: -1319.043191 hartree
zpe.sumelectthermalfe: -1319.105897 hartree
dipole: -4.6120 1.6032 1.1766
dipole: 5.0224
quadrupole: -101.1951 -122.9819 -131.9468
quadrupole: 5.6609 -2.1392 7.4085
quadrupole: 17.5128 -4.2740 -13.2388 5.6609 -2.1392 7.4085
hfenergy: -1319.3216121 hartree
pointgroup: C01 [X(C15H14Cl1N1O3)]
dipole: 1.7467585 0.9118504 -0.1477755 debye
polarizability: 228.9635464|5.3138811|166.7321951|-1.3338452|18.3111838|132.5054731 unknown
InChI: InChI=1S/C15H14ClNO3/c1-7-8(16)3-2-4-9(7)17-14(18)12-10-5-6-11(20-10)13(12)15(17)19/h2-4,10-13H,5-6H2,1H3
charge 0 multiplicity 1
34 atoms
Cl -4.46117 -2.337342 -0.19591
O  2.439505 -1.370452 0.466805
O  0.304343 1.468224 2.107463
O  0.156874 -0.059264 -2.339392
N  -0.099286 0.647473 -0.086588
C  2.182406 0.992279 0.545516
C  2.133996 0.511566 -0.938564
C  2.933585 -0.191499 1.245203
C  2.887209 -0.856942 -0.866888
C  4.436357 -0.134351 0.858705
C  4.40223 -0.599541 -0.644252
C  0.72378 1.088932 0.99204
C  0.64879 0.324746 -1.255264
C  -1.536041 0.539993 0.001436
C  -2.146825 -0.744004 -0.110631
C  -2.283344 1.719069 0.21127
C  -3.561545 -0.750175 -0.034394
C  -1.331154 -2.005184 -0.288999
C  -3.687666 1.651253 0.299172
C  -4.33886 0.405799 0.165979
H  2.688711 1.955879 0.714727
H  2.586014 1.196582 -1.673516
H  2.695082 -0.332578 2.30717
H  2.613423 -1.580848 -1.645138
H  5.013813 -0.838084 1.479657
H  4.865025 0.874136 0.989722
H  4.804106 0.157466 -1.339688
H  4.970556 -1.533062 -0.784562
H  -1.761978 2.675636 0.308208
H  -1.182047 -2.215972 -1.364493
H  -0.333345 -1.910028 0.172755
H  -1.846132 -2.871887 0.154948
H  -4.276224 2.55895 0.463291
H  -5.428487 0.331032 0.219711
