program: Gaussian 09
title: 000086460
version: EM64L-G09RevD.01
frameworkgroup: C1[X(C12H4Cl6O)]
method: RPBEPBE
basis: SDD
operation: Freq
keyword: #p
keyword: freq=noraman
keyword: PBEPBE/SDD
title: #p freq=noraman PBEPBE/SDD
converged: NO YES NO NO
title: Mulliken charges:
elementType: Cl Cl Cl Cl Cl Cl O C C C C C C C C C C C C H H H H
charge: 0.061353 0.061348 0.022329 0.022326 -0.006260 -0.003041 -0.281717 0.604504 0.411623 -0.284954 -0.284970 -0.083005 -0.083004 -0.283947 -0.381344 -0.250358 -0.056290 -0.160566 -0.132832 0.283730 0.290651 0.270424 0.264001
chargesum: 0.00000
title: Mulliken charges with hydrogens summed into heavy atoms:
elementType: Cl Cl Cl Cl Cl Cl O C C C C C C C C C C C C
charge: 0.061353 0.061348 0.022329 0.022326 -0.006260 -0.003041 -0.281717 0.604504 0.411623 -0.284954 -0.284970 -0.083005 -0.083004 -0.000217 -0.110921 0.040293 -0.056290 0.103436 -0.132832
polarizability: 2.45382986e+02 -3.50235863e-03 1.82667969e+02 2.30501223e+01 1.01714903e-02 1.50628457e+02
1716.lowfreq: -4.5298 -3.9780 -0.0028 -0.0024 -0.0021 3.5379 10.3922 19.4501 33.7110
frequency: 10.2751 19.4464 33.7034 68.1792 79.4067 90.0233 144.7060 165.0627 167.9147 180.7048 184.4259 194.9444 225.6988 261.8694 274.7382 302.7206 320.7467 329.1216 332.7273 357.8125 394.9570 430.7966 438.3353 481.6197 534.3940 539.7043 557.0736 586.7773 620.0214 631.8995 653.5229 674.0396 680.6019 742.1004 812.7873 816.4616 831.9603 855.3736 857.3721 926.4231 947.5810 998.6581 1061.7577 1109.0473 1130.6093 1160.9049 1179.3051 1217.3440 1249.9110 1342.6832 1346.8457 1370.9701 1390.3632 1390.4147 1450.7085 1548.4608 1550.1838 1579.8237 1599.1605 3168.3645 3172.0911 3187.2139 3188.4441
redmass: 26.0162 11.9251 19.4680 33.9841 22.9158 9.4090 11.4903 15.9059 5.8064 33.1168 28.4680 31.4115 14.4157 11.1537 8.3098 16.3533 12.7149 27.8676 11.6160 8.6539 10.1365 11.1393 3.0818 7.7866 6.7909 7.0816 4.8389 12.0659 6.5385 7.3905 13.5363 8.1109 3.6951 8.8910 1.3574 11.4554 9.3274 1.5125 1.4156 9.4476 1.3368 5.1725 10.4579 1.9720 1.2839 1.5013 6.0300 5.8751 1.4902 11.9954 9.3668 5.9643 4.8722 3.4217 2.6689 11.1459 8.6269 8.0292 7.6405 1.0891 1.0923 1.0931 1.0975
irintensity: 0.0049 0.2665 0.1000 0.0007 0.0420 0.6474 0.0837 0.7947 0.2315 0.0210 0.0241 0.0492 0.2108 0.0041 1.6427 0.9717 0.2011 0.0050 1.4741 2.3214 4.7110 9.4346 6.5589 5.4532 0.4023 8.0566 3.3818 0.0168 2.6454 25.5344 72.7960 9.0894 2.5938 0.2391 31.2733 2.2557 44.7606 25.6258 18.5672 136.1461 0.0439 60.3961 16.6329 95.0001 3.3968 34.0410 97.2583 57.6220 46.7862 0.0023 181.1401 115.8357 1.1924 129.4811 254.5600 45.6265 18.5058 41.8615 40.8705 1.4744 0.5181 3.5371 0.5273
temp: 298.150 k
press: 1.00000 atm
elementType: 17 17 17 17 17 17 8 6 6 6 6 6 6 6 6 6 6 6 6 1 1 1 1
symmnumber: 1
zpe: 323896.7 jmol-1
zpe.correction: 0.123366 hartree
zpe.thermalcorrener: 0.141523 hartree
zpe.thermalcorrenthalpy: 0.142467 hartree
zpe.thermalcorrgfe: 0.072801 hartree
zpe.sumelectzpe: -3293.894220 hartree
zpe.sumelectthermal: -3293.876064 hartree
zpe.sumelectthermalent: -3293.875119 hartree
zpe.sumelectthermalfe: -3293.944785 hartree
dipole: 1.7628 -0.0002 -0.9973
dipole: 2.0254
quadrupole: -149.7719 -154.6884 -146.4797
quadrupole: 0.0043 11.5307 0.0026
quadrupole: 0.5414 -4.3751 3.8336 0.0043 11.5307 0.0026
hfenergy: -3294.0175862 hartree
pointgroup: C01 [X(C12H4Cl6O1)]
dipole: 0.6685114 0.0004907 0.4336369 debye
dipolederiv: -0.1339979 -0.2516918 0.0842535 -0.2213875 -0.4772104 0.135605 0.0787075 0.1456593 -0.0318576 -0.1337761 0.2517574 0.083609 0.2214133 -0.4780698 -0.1346014 0.0781309 -0.1446466 -0.0312004 -0.2547526 -0.2778999 0.0843844 -0.3277765 -0.5261764 0.1194138 0.1290082 0.1505693 -0.0557136 -0.2544936 0.2779531 0.0836936 0.3279545 -0.5270344 -0.1183644 0.1281861 -0.1495341 -0.0550951 -0.0961719 -0.0000385 -0.0343935 -0.000221 -0.0268564 -0.0008483 -0.1715852 -0.0008321 -0.6780386 -0.7362184 -0.000174 -0.1728047 -0.0002464 -0.0257534 -0.000106 -0.2248306 -0.0001009 -0.1152657 -2.2778849 0.0000914 -0.0862407 0.0002371 -0.2480957 -0.0001266 0.0902765 -0.0001634 -0.3593177 1.2325347 -0.0002322 -0.0730736 -0.0010163 -0.0112804 0.0001719 -0.6831584 0.0002384 0.1409813 1.8574423 0.0001127 0.2453546 0.0007034 0.1145166 0.0001645 0.6344022 0.0001241 0.2708271 -0.0709978 0.4284386 -0.1156894 0.5119287 0.5303669 -0.2979436 -0.0173314 -0.2314953 -0.0008014 -0.071414 -0.4285172 -0.1145634 -0.5117096 0.5320192 0.2967448 -0.0160815 0.2302812 -0.0020311 0.3565552 0.4261991 -0.1530035 0.5928695 0.7109669 -0.2625348 -0.207536 -0.2322218 0.0489326 0.3561432 -0.4263569 -0.1519091 -0.5931772 0.7125186 0.2610798 -0.206063 0.2307812 0.047791 -0.3850057 -0.0000486 -0.0602865 -0.0004105 -0.0948292 -0.0003128 -0.3319394 -0.0002782 -0.3424874 -0.4020718 -0.0000878 -0.0934428 0.0000786 -0.1584953 0.0002515 0.0314464 0.000238 0.0269139 -0.1959838 -0.000013 0.031353 0.0000314 -0.3930698 0.0003662 0.071929 0.0003632 -0.0686261 0.0975703 0.0000222 0.0249674 0.0001765 -0.0224645 0.0014017 0.1430057 0.0013837 1.0520304 -0.0693078 0.0000479 0.0394409 -0.0000863 -0.0709689 0.0001996 -0.0602619 0.0002038 0.0809535 0.9517149 0.0002683 0.2577167 0.0004297 -0.0779517 -0.0001479 0.3766566 -0.0001543 -0.1806316 0.0460514 0.0000695 0.0490748 0.0001212 0.1352834 -0.0000966 0.097435 -0.0000989 0.0704486 0.0760365 0.0000583 0.0511884 0.0000591 0.0810319 0.0000571 0.0494861 0.0000537 0.1411245 0.105868 -0.0000497 -0.038752 -0.0000424 0.1639699 -0.0002206 -0.0364328 -0.0002213 -0.0069954 0.0021599 0.0000908 0.0591227 0.0000709 0.157583 -0.0001529 0.04655 -0.0001489 0.0480588 unknown
polarizability: 247.8217731|-0.0164003|182.6679554|-17.1544186|-0.024084|148.1896836 unknown
InChI: InChI=1S/C12H4Cl6O/c13-6-2-1-5(3-7(6)14)19-12-10(17)8(15)4-9(16)11(12)18/h1-4H
charge 0 multiplicity 1
23 atoms
Cl 0.955777 -2.763415 0.811137
Cl 0.956935 2.765504 0.804719
Cl 3.838152 2.754284 -0.767598
Cl 3.836961 -2.757052 -0.761274
Cl -2.975288 -0.003411 -2.872592
Cl -5.584342 -0.000579 -0.857916
O  -0.019512 0.002039 1.471142
C  1.146102 0.000868 0.691381
C  -1.294502 0.001343 0.845252
C  1.768062 -1.228399 0.354701
C  1.768585 1.229089 0.351868
C  3.008923 1.215653 -0.322049
C  3.008397 -1.217041 -0.319256
C  -1.465539 -0.000494 -0.55371
C  -2.39794 0.002604 1.724037
C  3.631425 -0.001218 -0.659929
C  -2.776244 -0.001071 -1.073476
C  -3.698104 0.001994 1.185605
C  -3.893502 0.000152 -0.213276
H  -0.611761 -0.00147 -1.236283
H  4.591369 -0.002031 -1.181304
H  -2.229385 0.004013 2.803524
H  -4.569071 0.002938 1.846696
