program: Gaussian 09
title: 000086465
version: EM64L-G09RevD.01
frameworkgroup: C1[X(C14H17BrO4S)]
method: RPBEPBE
basis: SDD
operation: Freq
keyword: #p
keyword: freq=noraman
keyword: PBEPBE/SDD
title: #p freq=noraman PBEPBE/SDD
converged: NO YES NO NO
title: Mulliken charges:
elementType: Br S O O O O C C C C C C C C C C C C C C H H H H H H H H H H H H H H H H H
charge: 0.037602 0.857955 -0.529372 -0.542964 -0.247342 -0.242286 -0.081467 -0.412570 -0.432533 -0.409230 -0.407669 -0.394481 0.238474 -0.039975 -0.254702 -0.199178 -0.169678 -0.171872 -0.501289 -0.211993 0.255301 0.252288 0.256411 0.228707 0.213353 0.220430 0.217751 0.214249 0.212116 0.197067 0.299179 0.287055 0.262254 0.262929 0.256186 0.241828 0.237464
chargesum: 0.00000
title: Mulliken charges with hydrogens summed into heavy atoms:
elementType: Br S O O O O C C C C C C C C C C C C C C
charge: 0.037602 0.857955 -0.529372 -0.542964 -0.247342 -0.242286 -0.081467 0.095020 0.052584 0.024553 0.024331 0.014703 0.238474 -0.039975 0.044477 0.087877 0.092576 0.091056 0.234188 -0.211993
polarizability: 2.93137487e+02 5.49118332e+00 1.82996765e+02 9.17353344e+00 -1.10230146e+01 1.59949738e+02
1716.lowfreq: -15.3085 -11.5563 -0.0008 0.0007 0.0007 1.4791 14.3225 26.1372 39.1046
frequency: 12.2421 25.8148 39.0218 42.5453 77.4522 80.0562 94.2132 104.2288 113.5005 127.3002 151.4160 181.3849 185.3694 192.0119 212.1095 235.2540 238.1310 268.7701 275.0855 321.3368 333.9462 358.7881 368.5208 393.5542 406.2828 407.6436 456.3679 473.2289 493.3162 513.5017 563.8787 579.7475 610.5114 684.3859 703.5887 734.0675 760.7268 789.0156 792.3990 822.4811 826.8886 838.1999 855.4427 888.6262 905.6746 919.3768 933.5236 958.6321 969.9514 975.5829 978.9654 995.1001 1039.4057 1043.8027 1054.0390 1091.8849 1096.5799 1105.6113 1111.7290 1122.3595 1134.5923 1154.9500 1178.9383 1190.8283 1234.6245 1243.5729 1279.2316 1283.4740 1306.7671 1308.6897 1318.9205 1332.9889 1344.0874 1360.6163 1372.8562 1375.1444 1419.3831 1445.3423 1448.3212 1452.0484 1459.2615 1464.2121 1464.9062 1472.9878 1478.8775 1560.7945 1587.6153 1595.4134 2974.9393 2983.9846 2987.4543 2989.7600 2999.3782 3009.3550 3037.7975 3046.7617 3055.0031 3075.8539 3087.9572 3115.5338 3152.3701 3157.3913 3167.4233 3176.6053 3184.3418
redmass: 5.1949 6.8578 4.3187 4.5625 2.6691 3.3624 6.9294 1.6906 5.3961 2.8973 4.7774 13.0575 6.1799 5.6501 9.2706 3.3499 4.0607 3.7099 3.4044 3.8208 10.2236 6.1697 2.0210 6.1492 2.9116 4.0846 3.2375 5.3644 3.1677 3.7064 3.4274 3.3592 7.0919 7.1731 3.9952 4.4631 5.9330 1.4268 12.4985 2.9782 1.3708 1.3407 1.5896 3.3860 2.7843 15.7611 1.3899 1.3543 3.2413 2.3662 2.2357 2.3178 2.2045 6.1028 1.8830 1.2528 2.0317 1.3510 1.2930 1.8708 1.7630 1.5660 1.1398 2.3675 1.9956 1.3043 1.3187 1.2338 1.5578 1.4691 1.2601 1.3855 1.4840 1.4789 2.8400 10.4906 1.2029 2.0162 1.1154 1.0511 1.0525 1.0859 1.0883 1.0833 1.0929 6.0801 8.1950 9.0292 1.0630 1.0634 1.0626 1.0614 1.0643 1.0292 1.0966 1.1009 1.1024 1.1001 1.0983 1.1050 1.0897 1.1051 1.0891 1.0961 1.0978
irintensity: 0.9315 0.4538 2.0828 2.0494 0.0568 1.2550 1.9976 0.9867 1.3172 0.7353 2.9095 4.5179 4.0055 8.0199 0.0101 5.4735 6.7242 4.2388 2.5146 28.0162 24.8083 0.0716 0.0694 11.3086 0.1017 8.2115 17.8335 23.9205 3.9636 101.0267 0.5053 1.3126 0.7241 46.2008 5.4203 1.5354 7.0217 0.8959 87.3978 0.5155 15.7750 29.1247 3.2110 3.2877 0.2055 59.5248 8.7794 0.3472 8.8074 30.9861 36.9454 47.3086 11.5202 76.9543 7.6083 0.0333 0.5849 6.7007 9.3554 122.2954 43.6989 51.8388 16.6911 112.1947 1.9767 12.3398 1.9376 1.3020 53.2515 22.0658 11.7554 1.5322 1.7434 10.7615 23.2774 0.6471 19.3170 43.7779 24.2437 20.4897 9.3946 5.2964 11.1316 40.7218 1.8989 43.5563 2.5078 116.3683 34.1201 23.0547 39.5115 4.5060 1.1411 28.6872 56.7716 31.0663 48.3751 8.9800 7.1948 17.0554 4.3143 14.3742 1.6347 2.2006 3.8340
temp: 298.150 k
press: 1.00000 atm
elementType: 35 16 8 8 8 8 6 6 6 6 6 6 6 6 6 6 6 6 6 6 1 1 1 1 1 1 1 1 1 1 1 1 1 1 1 1 1
symmnumber: 1
zpe: 744112.7 jmol-1
zpe.correction: 0.283418 hartree
zpe.thermalcorrener: 0.304627 hartree
zpe.thermalcorrenthalpy: 0.305571 hartree
zpe.thermalcorrgfe: 0.230171 hartree
zpe.sumelectzpe: -1254.445527 hartree
zpe.sumelectthermal: -1254.424318 hartree
zpe.sumelectthermalent: -1254.423374 hartree
zpe.sumelectthermalfe: -1254.498773 hartree
dipole: 1.6239 -1.5566 -3.9416
dipole: 4.5383
quadrupole: -122.7923 -124.8552 -150.2630
quadrupole: 1.7035 -10.2665 -5.9078
quadrupole: 9.8446 7.7816 -17.6262 1.7035 -10.2665 -5.9078
hfenergy: -1254.7289446 hartree
pointgroup: C01 [X(C14H17Br1O4S1)]
dipole: -0.85837 -0.1666629 1.5567559 debye
polarizability: 284.633285|-21.7781985|190.8523817|25.3862082|1.2019518|160.5983236 unknown
InChI: InChI=1S/C14H17BrO4S/c1-19-13(16)14(9-3-2-4-10-14)20(17,18)12-7-5-11(15)6-8-12/h5-8H,2-4,9-10H2,1H3
charge 0 multiplicity 1
37 atoms
Br 5.819567 -1.037146 1.320185
S  -0.052846 0.080408 -1.508519
O  -0.008201 1.597807 -2.119053
O  -0.309867 -1.218986 -2.475322
O  -2.460038 2.230369 -0.090849
O  -0.673077 1.823259 1.342711
C  -1.566647 -0.007477 -0.031704
C  -2.807653 -0.425904 -0.816319
C  -1.102569 -1.050338 0.986071
C  -3.966188 -0.758887 0.167537
C  -2.266693 -1.369485 1.9689
C  -3.538376 -1.815758 1.211584
C  -1.510303 1.413801 0.497568
C  1.602085 -0.238239 -0.644272
C  2.146578 -1.529027 -0.740571
C  2.250732 0.832469 -0.006438
C  3.410087 -1.767564 -0.15365
C  3.512505 0.5897 0.582456
C  -2.355938 3.675413 0.23155
C  4.069487 -0.705763 0.503601
H  -2.554017 -1.324264 -1.412514
H  -3.115509 0.369157 -1.514848
H  -0.223842 -0.685054 1.544742
H  -0.822874 -1.980219 0.452242
H  -4.831195 -1.120207 -0.419441
H  -4.289197 0.168313 0.680647
H  -2.488063 -0.470106 2.577305
H  -1.931813 -2.156376 2.670529
H  -4.361226 -1.994437 1.929666
H  -3.341758 -2.779976 0.699673
H  1.611447 -2.313345 -1.286013
H  1.797411 1.826813 0.027044
H  3.869954 -2.757557 -0.214168
H  4.047067 1.39657 1.090554
H  -1.40084 4.064952 -0.157317
H  -2.405005 3.8285 1.322382
H  -3.210586 4.137985 -0.28015
