program: Gaussian 09
title: 000086451
version: EM64L-G09RevD.01
frameworkgroup: C1[X(C11H11NO6S)]
method: RPBEPBE
basis: SDD
operation: Freq
keyword: #p
keyword: freq=noraman
keyword: PBEPBE/SDD
title: #p freq=noraman PBEPBE/SDD
converged: YES YES NO NO
title: Mulliken charges:
elementType: S O O O O O O N C C C C C C C C C C C H H H H H H H H H H H
charge: 0.879157 -0.543906 -0.507569 -0.273654 -0.233451 -0.195037 -0.197087 0.026195 -0.185155 -0.485979 -0.465105 0.327498 -0.068650 -0.162425 -0.219969 -0.354804 -0.339978 -0.495560 0.396257 0.293920 0.275088 0.286072 0.302590 0.308426 0.298535 0.297574 0.297144 0.246700 0.253000 0.240172
chargesum: 0.00000
title: Mulliken charges with hydrogens summed into heavy atoms:
elementType: S O O O O O O N C C C C C C C C C C C
charge: 0.879157 -0.543906 -0.507569 -0.273654 -0.233451 -0.195037 -0.197087 0.026195 -0.185155 0.083029 0.123557 0.327498 -0.068650 0.146001 0.078567 -0.057231 -0.042834 0.244312 0.396257
polarizability: 2.32085099e+02 1.48405133e+01 1.56657477e+02 -4.99050590e+00 2.38925445e+01 1.35674105e+02
1716.lowfreq: -6.3838 -0.0020 -0.0019 0.0014 3.5396 4.7770 20.0917 33.5729 41.0425
frequency: 20.0880 33.5586 41.0180 59.1755 76.3601 103.9806 105.0914 118.3868 123.1468 143.9285 185.4569 200.1282 216.2195 239.1190 243.9163 253.4857 279.7557 302.5284 313.8369 362.2547 397.5974 411.1900 412.3984 457.3089 495.9249 505.2939 526.4653 612.5711 638.4909 661.7938 680.7014 697.9413 734.8588 756.7249 776.9796 781.2711 798.5330 849.1503 868.9060 879.2950 906.5854 935.6935 951.6025 958.9394 986.2580 992.8319 999.3297 1043.8480 1065.7955 1085.7834 1094.7116 1097.5190 1107.1619 1112.6851 1147.0838 1171.6278 1173.6640 1195.0428 1217.7305 1284.0979 1320.7572 1369.3951 1391.3796 1405.0750 1421.7982 1424.6430 1431.4521 1452.4552 1453.3144 1463.1165 1580.4928 1605.5916 1626.8681 3011.8780 3101.3723 3108.6387 3117.8692 3159.1716 3160.4107 3181.0994 3188.2892 3196.6914 3212.0822 3230.7041
redmass: 4.9695 6.5593 7.3921 8.2207 5.2054 2.4932 1.7037 8.1849 3.5363 4.2969 7.7226 8.2976 6.1781 6.5917 3.2272 4.4257 6.6002 4.2030 6.2706 8.7099 8.2569 3.3798 5.9775 7.3801 4.5915 7.3089 8.1332 7.0904 3.4656 4.7263 8.7884 7.0662 4.3251 2.8284 1.4938 6.9414 7.4551 1.2855 2.3239 2.6933 7.4390 9.4948 2.9816 1.3528 1.3694 5.1444 1.4060 2.2985 1.2232 4.0546 2.0707 1.5239 1.2943 1.2604 1.4312 1.2911 1.2407 3.1200 8.6458 1.2495 4.0617 6.3414 5.5721 1.0861 6.2336 1.2409 1.2436 2.1208 1.0494 1.0520 6.1248 8.3836 10.5032 1.0293 1.0530 1.0586 1.1052 1.1054 1.0906 1.0894 1.0954 1.0974 1.1172 1.1157
irintensity: 0.0263 1.9635 0.5899 1.1026 0.7940 3.5086 0.6067 5.7220 2.1952 2.7609 4.9169 1.0967 4.0498 10.9496 3.7838 3.0858 0.2523 28.1906 11.0942 4.4191 19.4255 3.6246 29.6158 17.1554 20.8799 0.6265 82.2783 0.2625 12.8614 31.5877 35.6550 10.3202 6.4912 1.5281 6.3358 44.6569 52.8158 4.6678 23.4726 23.9027 21.8375 76.1311 9.1636 10.1006 2.8095 5.1756 1.2984 34.5239 69.9764 5.3284 179.5255 76.5953 14.9002 0.0116 16.5078 0.1633 10.3822 67.7157 261.3894 0.3569 108.6944 51.0539 67.0461 21.2296 40.5802 32.0240 14.0732 9.6823 15.4867 13.8962 18.7433 2.5692 160.7529 27.0306 2.0391 1.3450 18.4247 11.2870 5.6487 5.1085 2.7478 3.5138 0.3429 0.3596
temp: 298.150 k
press: 1.00000 atm
elementType: 16 8 8 8 8 8 8 7 6 6 6 6 6 6 6 6 6 6 6 1 1 1 1 1 1 1 1 1 1 1
symmnumber: 1
zpe: 547335.6 jmol-1
zpe.correction: 0.208469 hartree
zpe.thermalcorrener: 0.227559 hartree
zpe.thermalcorrenthalpy: 0.228503 hartree
zpe.thermalcorrgfe: 0.159002 hartree
zpe.sumelectzpe: -1328.236502 hartree
zpe.sumelectthermal: -1328.217412 hartree
zpe.sumelectthermalent: -1328.216468 hartree
zpe.sumelectthermalfe: -1328.285969 hartree
dipole: -5.0837 2.9205 -3.7636
dipole: 6.9670
quadrupole: -129.3245 -117.8666 -121.2204
quadrupole: -18.0167 11.2060 5.1221
quadrupole: -6.5207 4.9372 1.5835 -18.0167 11.2060 5.1221
hfenergy: -1328.4449709 hartree
pointgroup: C01 [X(C11H11N1O6S1)]
dipole: -2.0118291 1.0762693 -1.5189917 debye
polarizability: 232.4224539|13.1188447|159.66841|-8.091613|21.7375673|132.3258165 unknown
InChI: InChI=1S/C11H11NO6S/c1-18-10(13)11(6-7-11)19(16,17)9-4-2-8(3-5-9)12(14)15/h2-5H,6-7H2,1H3
charge 0 multiplicity 1
30 atoms
S  -1.234206 -1.313063 0.954555
O  -1.323272 -2.866864 0.432222
O  -1.525547 -0.928775 2.507071
O  -3.630037 1.656049 -0.59234
O  -1.675453 1.741425 0.676343
O  4.963234 1.468401 0.189451
O  5.146507 -0.294568 -1.246107
N  4.489941 0.423172 -0.398981
C  -2.500091 -0.389974 -0.186044
C  -2.70263 -1.019353 -1.575777
C  -3.749832 -1.226294 -0.489743
C  -2.52881 1.083943 0.036909
C  0.51295 -0.715387 0.493685
C  1.03214 0.416297 1.14408
C  1.237665 -1.509901 -0.410315
C  2.35827 0.792145 0.846427
C  2.561336 -1.127932 -0.712297
C  -3.744442 3.133577 -0.463924
C  3.091161 0.018712 -0.081146
H  -2.073681 -1.883728 -1.811412
H  -2.898856 -0.318522 -2.391176
H  -4.689169 -0.671335 -0.531678
H  -3.783461 -2.221282 -0.034657
H  0.418812 0.977639 1.852761
H  0.784938 -2.411703 -0.834421
H  2.825958 1.662373 1.313149
H  3.181861 -1.697951 -1.408077
H  -2.849415 3.620953 -0.88439
H  -3.848498 3.409743 0.597975
H  -4.646574 3.392807 -1.034245
