program: Gaussian 09
title: 000086435
version: EM64L-G09RevD.01
frameworkgroup: C1[X(C11H11Cl2NO3)]
method: RPBEPBE
basis: SDD
operation: Freq
keyword: #p
keyword: freq=noraman
keyword: PBEPBE/SDD
title: #p freq=noraman PBEPBE/SDD
converged: YES YES NO NO
title: Mulliken charges:
elementType: Cl Cl O O O N C C C C C C C C C C C H H H H H H H H H H H
charge: -0.020435 -0.046122 -0.345883 -0.251258 -0.408959 -0.144865 -0.445862 -0.446203 -0.348834 -0.352044 0.257387 0.608180 -0.471334 -0.314136 0.454586 -0.218988 -0.321613 0.227206 0.232582 0.225956 0.233870 0.253896 0.231340 0.253799 0.237209 0.281225 0.278037 0.361265
chargesum: 0.00000
title: Mulliken charges with hydrogens summed into heavy atoms:
elementType: Cl Cl O O O N C C C C C C C C C C C
charge: -0.020435 -0.046122 -0.345883 -0.251258 -0.047694 -0.144865 0.013925 0.013624 0.136402 0.138963 0.257387 0.608180 -0.190109 -0.314136 0.454586 0.059049 -0.321613
polarizability: 2.30842865e+02 1.15840400e+01 1.40471934e+02 -6.94437212e+00 3.39663162e+00 9.61233024e+01
1716.lowfreq: -0.0015 -0.0014 -0.0010 2.8983 4.8004 8.0439 23.8230 31.1058 43.5496
frequency: 23.8164 30.8972 43.5137 73.3172 97.0590 113.9240 138.6239 162.3219 186.8954 222.1499 237.7980 243.6452 252.5602 284.2224 305.0998 356.7509 370.3113 412.5885 435.6329 451.0278 492.0131 550.1411 567.2292 601.3500 615.2681 668.7617 672.3382 674.8275 706.7916 738.6682 763.9130 844.6997 847.8446 864.3539 877.5645 910.1551 918.4136 933.8078 974.3914 990.6808 1035.6120 1058.6285 1117.8227 1136.4367 1157.4696 1162.3367 1181.3489 1189.4459 1218.8072 1232.6432 1243.0302 1260.8672 1303.8292 1312.8762 1319.8058 1341.4570 1356.2785 1375.9007 1419.0607 1456.2245 1468.4699 1473.4078 1491.0946 1498.0024 1578.8992 1610.8884 1703.5287 2990.7140 2993.7940 3012.6819 3013.6945 3065.9460 3073.4321 3083.6980 3096.8900 3183.0282 3190.3393 3503.8772
redmass: 6.1007 5.2158 7.6899 2.9494 7.3805 5.1264 7.0911 9.4907 14.4536 3.4026 1.7321 5.9646 5.9561 6.4558 10.7146 12.0505 12.4930 8.3552 1.2572 2.4059 6.5171 4.6876 1.8651 9.3067 7.9232 4.6999 7.3243 8.7940 4.3230 5.4893 3.2018 1.4665 1.8017 1.9192 1.5893 2.9875 1.5931 2.4240 2.3703 2.8560 7.6069 1.9311 1.5839 1.6977 1.8919 1.5016 1.7605 1.6854 1.2979 1.3496 1.3163 8.2329 1.3476 1.2576 1.8653 1.5021 2.9286 8.5674 4.4901 3.8817 1.0884 1.0913 1.0783 1.0883 8.5641 7.7504 12.0664 1.0644 1.0664 1.0663 1.0612 1.0992 1.0977 1.1013 1.1057 1.0930 1.0931 1.0650
irintensity: 2.0028 0.3810 1.2512 0.4344 0.6542 1.2400 0.0314 0.2558 1.1273 5.0557 0.0398 5.0221 0.5722 14.5329 4.7925 1.6133 0.2899 1.6326 152.5345 5.8994 8.8703 16.5027 2.7802 2.3142 12.1326 16.6888 7.4846 57.4657 16.1995 4.3925 38.7728 5.2857 47.2617 4.6897 47.1837 40.1792 1.9856 45.9135 50.6752 148.4257 94.6445 22.4490 21.6275 285.5825 8.0056 28.4722 31.9739 90.9263 28.5382 51.4666 8.4287 36.6404 2.6117 27.3842 147.9664 15.5698 260.7023 44.0845 4.9124 206.7892 9.6515 16.8224 4.6374 5.9865 20.2007 20.0913 463.8062 59.9357 5.9138 29.5196 28.2641 19.5044 12.8202 26.1822 58.1433 0.9705 0.1072 68.0328
temp: 298.150 k
press: 1.00000 atm
elementType: 17 17 8 8 8 7 6 6 6 6 6 6 6 6 6 6 6 1 1 1 1 1 1 1 1 1 1 1
symmnumber: 1
zpe: 535733.4 jmol-1
zpe.correction: 0.204050 hartree
zpe.thermalcorrener: 0.220395 hartree
zpe.thermalcorrenthalpy: 0.221339 hartree
zpe.thermalcorrgfe: 0.157883 hartree
zpe.sumelectzpe: -1625.059188 hartree
zpe.sumelectthermal: -1625.042843 hartree
zpe.sumelectthermalent: -1625.041899 hartree
zpe.sumelectthermalfe: -1625.105355 hartree
dipole: 2.8003 -0.4110 -2.0256
dipole: 3.4805
quadrupole: -82.7184 -111.9344 -118.4640
quadrupole: -1.7403 -2.8549 0.3088
quadrupole: 21.6539 -7.5621 -14.0917 -1.7403 -2.8549 0.3088
hfenergy: -1625.2632379 hartree
pointgroup: C01 [X(C11H11Cl2N1O3)]
dipole: 1.1085864 -0.0386437 -0.802863 debye
polarizability: 230.948096|12.3225405|138.3673863|-3.9374391|10.076772|98.1226187 unknown
InChI: InChI=1S/C11H11Cl2NO3/c12-7-5-8(13)10(6-9(7)15)17-11(16)14-3-1-2-4-14/h5-6,15H,1-4H2
charge 0 multiplicity 1
28 atoms
Cl -0.280274 2.616617 0.241204
Cl -5.381017 0.349452 0.193828
O  0.582338 -0.242663 -0.528087
O  1.021755 -0.315127 1.814654
O  -3.823046 -2.202534 -0.535435
N  2.747071 -0.206449 0.225924
C  4.71988 0.229977 -1.021375
C  5.103501 -0.48147 0.304127
C  3.212459 -0.08379 -1.181705
C  3.865453 -0.260669 1.204498
C  1.451913 -0.248711 0.641075
C  -0.799535 -0.087649 -0.295197
C  -1.639808 -1.199721 -0.480819
C  -1.354933 1.172527 0.035119
C  -3.037973 -1.069939 -0.337017
C  -2.745123 1.322861 0.192868
C  -3.567029 0.200003 0.003497
H  4.869889 1.320655 -0.922433
H  5.310043 -0.120856 -1.884231
H  5.25481 -1.562011 0.126559
H  6.022778 -0.076254 0.758448
H  2.652167 0.706757 -1.707177
H  3.047291 -1.034647 -1.723957
H  3.697944 -1.070279 1.935096
H  3.926584 0.692575 1.764472
H  -1.212018 -2.172985 -0.731531
H  -3.174526 2.293653 0.451509
H  -4.782495 -1.985022 -0.392214
