program: Gaussian 09
title: 000086478
version: EM64L-G09RevD.01
frameworkgroup: C1[X(C10H22N4O)]
method: RPBEPBE
basis: SDD
operation: Freq
keyword: #p
keyword: freq=noraman
keyword: PBEPBE/SDD
title: #p freq=noraman PBEPBE/SDD
converged: NO YES NO NO
title: Mulliken charges:
elementType: O N N N N C C C C C C C C C C H H H H H H H H H H H H H H H H H H H H H H
charge: -0.459840 0.005010 -0.109512 -0.634431 -0.649873 -0.308149 -0.376405 -0.420237 -0.424923 -0.326969 -0.419465 -0.388992 -0.372987 -0.494825 0.205939 0.189200 0.240655 0.248441 0.247235 0.206290 0.250183 0.208115 0.226233 0.211205 0.242569 0.204337 0.193507 0.196156 0.209108 0.199046 0.196844 0.244387 0.207348 0.317072 0.292029 0.307720 0.337981
chargesum: 0.00000
title: Mulliken charges with hydrogens summed into heavy atoms:
elementType: O N N N N C C C C C C C C C C
charge: -0.459840 0.005010 -0.109512 -0.025329 -0.004172 0.121705 0.119271 0.036236 0.009424 0.126804 -0.021622 0.016273 0.022902 -0.043090 0.205939
polarizability: 1.88744158e+02 1.28478501e+00 1.33863868e+02 -4.50400727e+00 -2.50096862e+00 1.09144497e+02
1716.lowfreq: -38.4918 -15.4186 -10.0837 -0.0012 -0.0006 -0.0005 23.5597 31.7750 44.3019
frequency: 17.0921 31.5457 43.8279 71.8233 101.9593 157.6986 176.4841 192.4955 216.4034 236.6586 245.3525 268.5655 299.5996 315.2860 365.3601 376.4775 379.3197 398.1839 411.7543 448.1909 464.7786 482.9306 487.1795 524.6749 551.0514 556.8750 584.9570 666.6627 680.3110 733.2127 756.5501 793.8106 805.6409 830.4649 850.6340 859.9420 871.5246 889.4966 901.4279 965.1450 984.4578 998.5105 1001.9671 1038.3770 1040.5106 1050.5268 1083.2344 1098.9265 1114.9773 1117.7392 1123.3637 1145.8915 1172.4187 1193.0245 1211.8650 1219.8701 1249.6963 1261.1057 1271.1261 1281.0240 1291.7913 1311.7315 1319.5742 1336.9460 1344.6258 1345.6082 1346.4431 1358.9105 1366.0688 1371.4482 1412.1939 1440.8262 1445.5862 1460.2221 1461.6818 1464.1231 1472.4587 1473.7050 1486.9285 1494.7150 1600.4429 1617.7745 1671.9246 2917.9053 2953.3870 2968.1232 2971.4251 2975.6578 2978.9991 2985.3651 3005.2929 3010.6459 3015.2398 3019.6234 3025.4425 3033.6181 3038.6575 3049.6200 3094.8731 3098.5883 3112.5032 3526.1489 3539.4352 3674.9246 3680.8351
redmass: 4.1979 3.7066 3.1302 3.2859 2.9739 3.0540 2.7128 2.6042 2.2951 2.6732 2.8395 4.7540 2.5809 2.4162 1.1739 3.0087 2.0655 3.2285 1.2743 2.3228 1.8149 1.2751 1.7336 2.6538 1.9129 1.6672 2.7844 3.2465 4.9490 1.6966 2.2621 2.1474 1.4004 2.5248 2.3041 2.2897 2.1213 2.1949 3.7514 2.2840 2.2164 1.9318 2.2393 1.4400 2.0648 2.1343 1.8643 2.4770 2.2587 2.3129 2.0728 1.5429 1.4689 1.5411 1.2664 1.2368 1.2925 1.1689 1.2146 1.1406 1.1862 1.2780 1.3685 1.3923 1.3582 1.3118 1.3704 1.4056 1.3982 1.3665 4.3786 1.0894 1.0827 1.0800 1.0772 1.0882 1.0845 1.0803 1.0774 1.0771 1.2331 1.2889 3.4708 1.0561 1.0620 1.0614 1.0629 1.1013 1.0659 1.0650 1.0661 1.0928 1.0684 1.0882 1.0991 1.0979 1.0965 1.0662 1.0988 1.1047 1.1013 1.0449 1.0454 1.1018 1.1022
irintensity: 6.3518 1.6675 0.4550 2.0433 8.5016 1.1127 0.8644 4.9603 4.8496 2.8053 2.8406 16.8484 16.4495 12.8472 97.3577 3.3373 5.1775 13.9949 59.6191 0.2673 20.5659 243.9760 27.1190 2.4056 127.5794 120.5673 21.7938 26.4695 69.8127 6.3608 3.4599 3.4807 4.0514 9.8466 6.4563 0.5412 6.5965 13.5986 1.3157 8.3757 1.9963 4.0309 9.2909 6.8140 7.2880 4.9095 2.8421 0.2533 3.8810 0.6599 2.2553 1.6230 2.6058 3.6852 1.7558 0.1565 1.9629 5.2898 7.6504 4.8399 1.7289 1.6887 0.4136 1.2146 0.8576 0.9811 0.3755 2.1945 2.9633 7.5769 120.9929 14.4334 8.5804 11.1810 5.7669 15.5340 3.8555 19.0075 3.7353 42.8765 115.8765 107.8432 618.5740 38.4211 35.2605 20.6560 23.3796 33.4094 23.9412 15.6089 17.7181 68.5564 33.5798 20.0548 67.0928 44.4045 51.9486 32.8951 17.6027 22.4979 21.0841 22.8195 13.6843 19.3870 20.1711
temp: 298.150 k
press: 1.00000 atm
elementType: 8 7 7 7 7 6 6 6 6 6 6 6 6 6 6 1 1 1 1 1 1 1 1 1 1 1 1 1 1 1 1 1 1 1 1 1 1
symmnumber: 1
zpe: 856777.4 jmol-1
zpe.correction: 0.326329 hartree
zpe.thermalcorrener: 0.342918 hartree
zpe.thermalcorrenthalpy: 0.343863 hartree
zpe.thermalcorrgfe: 0.281353 hartree
zpe.sumelectzpe: -687.171099 hartree
zpe.sumelectthermal: -687.154510 hartree
zpe.sumelectthermalent: -687.153566 hartree
zpe.sumelectthermalfe: -687.216076 hartree
dipole: -0.7890 1.1403 -2.4062
dipole: 2.7771
quadrupole: -63.5465 -90.9898 -99.0764
quadrupole: 6.0343 -0.1488 4.3829
quadrupole: 20.9910 -6.4522 -14.5388 6.0343 -0.1488 4.3829
hfenergy: -687.4974284 hartree
pointgroup: C01 [X(C10H22N4O1)]
dipole: -0.3311138 0.3007655 -0.9968438 debye
polarizability: 188.4614665|-0.4154597|132.4962372|-6.6974708|-6.0938564|110.7948195 unknown
InChI: InChI=1S/C10H22N4O/c11-10(12)13-6-9-14(15)7-4-2-1-3-5-8-14/h1-9,11-12H2
charge 0 multiplicity 1
37 atoms
O  0.211312 -1.008883 1.66145
N  0.575422 -0.192481 0.529678
N  -3.018965 0.497273 -0.527273
N  -5.313739 1.000736 -0.502008
N  -4.650404 -1.087865 0.340768
C  1.140125 -1.114838 -0.573128
C  1.601489 0.823941 1.053408
C  2.450335 -1.816468 -0.162226
C  2.227499 1.838465 0.077969
C  -0.660256 0.551716 -0.002254
C  3.753102 -1.267674 -0.80026
C  3.239284 1.304297 -0.976111
C  4.19416 0.184467 -0.472333
C  -1.895777 -0.357384 -0.091703
C  -4.24551 0.127064 -0.238286
H  1.250493 -0.53921 -1.510943
H  0.337439 -1.856494 -0.70488
H  2.36491 0.206171 1.549433
H  1.049595 1.341203 1.856393
H  2.367235 -2.880241 -0.458169
H  2.485859 -1.832383 0.944573
H  2.769369 2.551741 0.732954
H  1.440483 2.435569 -0.423143
H  -0.432019 0.998595 -0.987179
H  -0.876571 1.357356 0.718067
H  4.578895 -1.947644 -0.506613
H  3.665526 -1.355125 -1.904292
H  2.710116 0.946339 -1.88061
H  3.839906 2.171352 -1.314645
H  4.361853 0.292191 0.618423
H  5.186935 0.331319 -0.942432
H  -2.011545 -0.828092 0.9089
H  -1.720591 -1.172746 -0.82748
H  -5.037684 1.903791 -0.884134
H  -6.208515 0.615472 -0.801088
H  -5.514589 -1.124314 0.878516
H  -3.942675 -1.788415 0.547655
