program: Gaussian 09
title: 000086421
version: EM64L-G09RevD.01
frameworkgroup: C1[X(C15H13Cl2F2NO3)]
method: RPBEPBE
basis: SDD
operation: Freq
keyword: #p
keyword: freq=noraman
keyword: PBEPBE/SDD
title: #p freq=noraman PBEPBE/SDD
converged: YES YES NO NO
title: Mulliken charges:
elementType: Cl Cl F F O O O N C C C C C C C C C C C C C C C H H H H H H H H H H H H H
charge: -0.029879 -0.002953 -0.197887 -0.210207 -0.324621 -0.285646 -0.231943 -0.146151 0.359219 -0.468066 -0.467807 -0.395842 -0.398163 0.295771 0.544491 -0.426326 -0.385339 0.508436 -0.198579 -0.348265 -0.364363 0.198250 -0.447789 0.255674 0.243204 0.243511 0.254916 0.280819 0.242505 0.249724 0.268841 0.328295 0.281986 0.244446 0.249471 0.280268
chargesum: 0.00000
title: Mulliken charges with hydrogens summed into heavy atoms:
elementType: Cl Cl F F O O O N C C C C C C C C C C C C C C C
charge: -0.029879 -0.002953 -0.197887 -0.210207 -0.324621 -0.285646 -0.231943 -0.146151 0.359219 0.030812 0.030619 0.127482 0.120402 0.295771 0.544491 -0.098031 -0.385339 0.508436 0.083407 -0.348265 0.129554 0.198250 -0.167522
polarizability: 2.99353844e+02 2.49550539e+01 2.14773010e+02 1.10361178e+01 -4.65140856e-01 1.05071523e+02
1716.lowfreq: -4.6810 -0.0017 -0.0006 0.0017 1.2175 3.6239 9.9226 18.2556 34.7002
frequency: 9.3011 18.0369 34.6910 44.4960 48.0081 75.7937 83.5418 100.2554 113.2596 117.5810 143.0263 158.1234 167.0145 186.7543 217.1252 222.6880 253.4948 272.6133 291.3302 302.8694 328.6617 344.8592 360.7302 363.5341 392.8809 428.1764 440.3988 448.2133 448.7298 461.8317 473.7163 500.2591 541.5839 584.2755 621.3497 636.3181 640.2147 645.9624 674.0782 686.8412 707.1750 709.3219 715.5578 726.1448 779.0553 804.1813 853.7573 868.8269 874.2784 901.4125 938.7821 958.9661 965.8106 989.3428 990.6579 1001.6527 1007.4566 1043.2620 1048.9341 1061.2074 1124.8254 1142.8824 1157.0315 1177.1326 1209.8371 1210.4231 1245.1101 1254.9812 1266.7351 1271.5671 1274.9738 1329.8350 1342.6852 1345.5276 1356.3524 1364.3041 1370.3677 1379.7930 1407.2893 1442.8000 1456.4739 1457.6190 1470.7057 1473.8949 1477.9967 1581.2166 1586.6209 1659.6100 2162.7420 2959.4157 3005.4551 3007.0003 3015.4410 3027.1649 3031.2245 3095.7226 3099.0697 3111.3680 3138.0140 3180.7283 3200.6671 3426.2419
redmass: 6.6324 9.2759 8.6689 7.7025 6.4591 7.5327 7.0306 5.3462 4.5385 7.2501 5.5696 7.7015 10.6312 6.2467 7.3438 4.2982 6.2397 5.5845 7.3921 6.3509 3.2193 2.8588 8.3388 5.4613 4.6934 2.6718 7.6966 3.1475 3.4684 6.6111 4.4544 6.1647 6.8303 4.7817 7.0233 4.6793 1.2366 6.2141 9.6690 1.2674 3.0602 4.6591 6.8987 8.3002 6.0728 1.5057 1.5650 1.5212 2.8704 6.3418 4.2284 2.4366 2.5993 1.7335 3.1399 1.6169 3.1984 3.2507 5.9214 4.4403 2.4451 2.1251 1.9101 1.6125 1.7463 1.0536 1.3278 2.2617 4.6360 1.4733 1.6968 1.3880 1.7489 2.0019 1.5377 3.5588 1.4183 4.1560 2.3591 1.0902 1.1071 1.4852 1.0948 1.7586 1.0970 8.6735 8.3837 9.5523 5.9919 1.0548 1.0692 1.0686 1.1055 1.0601 1.0607 1.1019 1.1029 1.0985 1.0954 1.0930 1.0913 1.1618
irintensity: 0.1828 0.7930 0.0095 0.5301 1.8948 1.8467 2.2837 0.4386 3.9404 1.2094 3.3811 2.1192 1.4119 1.9291 1.9448 1.5494 3.0023 5.6353 1.9877 1.5969 8.1505 16.2669 0.6962 10.4259 5.7182 1.4143 1.1812 7.4171 7.6205 4.9596 4.6173 1.1718 1.9173 27.3446 3.2664 2.5476 71.2165 3.0824 20.6507 49.3928 0.6000 2.1014 77.7071 20.5433 10.9458 3.8081 0.0477 26.1039 87.3120 32.9883 89.6908 19.5897 7.1571 10.3668 41.7046 13.4781 126.8040 29.7638 308.0532 281.3080 79.4251 30.9558 322.1530 15.0984 379.3585 0.8944 8.7100 168.9715 60.3709 20.3074 2.7826 1.9745 93.3944 147.6537 6.3039 141.3851 37.3782 20.7506 135.6827 15.4803 14.9962 235.9028 42.1772 171.5998 16.7302 45.2684 30.2973 356.2974 5.0065 19.6677 11.5761 46.8143 15.2517 4.1701 12.6341 9.2946 20.0177 2.3586 2.5070 0.9641 20.6581 71.0534
temp: 298.150 k
press: 1.00000 atm
elementType: 17 17 9 9 8 8 8 7 6 6 6 6 6 6 6 6 6 6 6 6 6 6 6 1 1 1 1 1 1 1 1 1 1 1 1 1
symmnumber: 1
zpe: 664688.5 jmol-1
zpe.correction: 0.253167 hartree
zpe.thermalcorrener: 0.275634 hartree
zpe.thermalcorrenthalpy: 0.276579 hartree
zpe.thermalcorrgfe: 0.197661 hartree
zpe.sumelectzpe: -1977.871247 hartree
zpe.sumelectthermal: -1977.848779 hartree
zpe.sumelectthermalent: -1977.847835 hartree
zpe.sumelectthermalfe: -1977.926752 hartree
dipole: -0.9200 1.9771 -0.7375
dipole: 2.3020
quadrupole: -167.9945 -135.4982 -147.4025
quadrupole: 6.9104 1.6937 -0.1474
quadrupole: -17.6961 14.8002 2.8959 6.9104 1.6937 -0.1474
hfenergy: -1978.1244131 hartree
pointgroup: C01 [X(C15H13Cl2F2N1O3)]
dipole: -0.2922761 -0.8333503 -0.2008881 debye
polarizability: 303.6696447|-10.0661627|181.1578995|-14.7710332|47.6536895|134.3708325 unknown
InChI: InChI=1S/C15H13Cl2F2NO3/c1-2-7-22-12-9-13(11(17)8-10(12)16)23-14(21)20-5-3-15(18,19)4-6-20/h1,8-9H,3-7H2
charge 0 multiplicity 1
36 atoms
Cl -0.365333 2.871548 2.211998
Cl 5.081759 2.272387 1.33225
F  -6.061501 0.539233 -1.411135
F  -5.958112 -1.007133 0.284861
O  -0.586817 0.283666 0.83535
O  -0.407764 -1.46142 -0.771923
O  4.294886 -0.255059 -0.001237
N  -2.457801 -0.855692 0.195929
C  -5.127129 -0.189157 -0.590583
C  -4.329984 0.778628 0.277349
C  -4.290835 -1.121989 -1.460972
C  -3.264433 0.004408 1.093155
C  -3.225018 -1.84181 -0.59662
C  -1.099373 -0.754066 0.005701
C  0.764977 0.679486 0.873735
C  1.843338 -0.070024 0.349796
C  1.012576 1.904549 1.533027
C  3.168982 0.410261 0.484447
C  2.326182 2.387969 1.672294
C  3.396357 1.643952 1.150118
C  4.056434 -1.553675 -0.684577
C  5.346942 -2.101737 -1.100848
C  6.409639 -2.601971 -1.468336
H  -5.019782 1.308887 0.955941
H  -3.844399 1.523687 -0.37701
H  -3.802048 -0.523913 -2.24996
H  -4.954898 -1.859356 -1.943551
H  -2.603063 0.7012 1.623322
H  -3.770704 -0.640984 1.836391
H  -3.72177 -2.549863 0.093599
H  -2.521146 -2.401842 -1.230406
H  1.615383 -0.998916 -0.172476
H  2.513137 3.335978 2.182593
H  3.547936 -2.24851 0.014602
H  3.400237 -1.392047 -1.563912
H  7.343944 -3.029576 -1.78451
