program: Gaussian 09
title: 000077643
version: EM64L-G09RevD.01
frameworkgroup: C1[X(C10H14O2)]
method: RPBEPBE
basis: SDD
operation: Freq
keyword: #pfreq=noraman
keyword: PBEPBE/SDD
title: #p freq=noraman PBEPBE/SDD
converged: YES YES NO NO
title: Mulliken charges:
elementType: O O C C C C C C C C C C H H H H H H H H H H H H H H
charge: -0.461423 -0.505872 0.183342 0.367783 -0.749326 -0.725205 -0.725086 0.028921 -0.401548 0.149785 -0.243520 -0.373988 0.216554 0.214358 0.214308 0.209680 0.200393 0.265937 0.200441 0.209678 0.265827 0.251982 0.222504 0.222214 0.387517 0.374745
chargesum: 0.00000
title: Mulliken charges with hydrogens summed into heavy atoms:
elementType: O O C C C C C C C C C C
charge: -0.073906 -0.131127 0.183342 0.367783 -0.104105 -0.049195 -0.049140 0.028921 -0.149567 0.149785 -0.021016 -0.151774
polarizability: 1.43973516e+02 -2.40988121e+00 1.23874247e+02 3.54725876e-02 2.42250884e-03 7.18858072e+01
1716.lowfreq: -8.4061 -0.0009 -0.0007 0.0006 8.3547 11.8963 74.5651 97.6555 198.5396
frequency: 74.5489 97.6515 198.5384 199.0228 218.0504 246.1271 253.4917 269.1264 288.2980 318.0294 323.3323 325.7676 334.9526 392.1532 403.5045 481.8898 510.1208 511.0743 544.7620 571.0077 592.9272 625.3632 724.7720 765.7497 785.6310 821.2130 863.1380 902.7889 919.0702 937.9027 945.7929 950.7763 1018.9010 1035.1239 1071.2600 1103.9259 1150.3288 1177.3354 1203.5058 1207.5984 1219.2899 1256.3836 1275.4360 1312.0313 1371.3474 1375.4478 1401.5183 1410.2521 1451.5629 1457.7533 1469.0969 1475.1491 1478.8612 1489.2563 1496.4710 1505.9541 1592.1132 1626.1703 2970.8174 2975.2446 2979.4682 3061.9935 3064.9062 3069.5999 3073.8794 3105.8119 3108.9563 3122.6277 3149.0188 3174.2461 3494.1059 3630.8617
redmass: 3.2736 4.3379 2.4072 3.0213 1.3906 1.1059 1.0877 3.3846 2.9963 4.4305 1.0572 3.2200 3.1015 2.6469 2.9126 5.1303 1.1155 2.9644 3.4908 4.8508 4.8669 5.3545 1.9771 2.1937 4.2461 4.6316 1.3732 3.2495 1.7294 1.6586 1.3027 1.2166 1.4765 1.3769 2.0290 1.6178 1.5245 1.3919 2.9189 2.1506 2.6450 2.2361 3.0622 1.5781 1.2136 1.1828 1.2204 4.3895 2.6661 1.0470 1.1473 1.0481 1.1140 1.0517 2.1457 1.0632 7.1925 6.6596 1.0351 1.0363 1.0370 1.1003 1.0994 1.0997 1.0983 1.0985 1.0978 1.0883 1.0918 1.0958 1.0644 1.0667
irintensity: 0.4693 3.0843 2.7796 3.5380 0.9660 168.1038 0.2562 11.6614 2.5439 3.3033 0.1328 3.0735 2.3843 1.4078 3.0052 1.0858 106.7796 1.2533 1.2503 11.7325 0.3755 1.5081 47.9728 38.6835 15.0494 8.6467 0.0005 89.3488 1.7397 24.2927 1.1267 0.3152 1.7299 0.4634 39.8276 94.7153 25.3922 7.7267 7.3174 122.8788 9.6502 51.0191 79.2881 92.2676 23.5722 25.1524 13.0640 15.8933 71.9996 0.4580 5.1746 0.1138 7.7992 10.5249 4.2248 21.5964 12.6091 12.8497 22.7657 44.8134 48.0164 6.5644 10.7321 51.9994 100.6158 1.1085 20.2182 10.5184 14.5218 14.6343 76.1082 50.9405
temp: 298.150 k
press: 1.00000 atm
elementType: 8 8 6 6 6 6 6 6 6 6 6 6 1 1 1 1 1 1 1 1 1 1 1 1 1 1
symmnumber: 1
zpe: 568287.1 jmol-1
zpe.correction: 0.216449 hartree
zpe.thermalcorrener: 0.228835 hartree
zpe.thermalcorrenthalpy: 0.229780 hartree
zpe.thermalcorrgfe: 0.179559 hartree
zpe.sumelectzpe: -538.988664 hartree
zpe.sumelectthermal: -538.976278 hartree
zpe.sumelectthermalent: -538.975334 hartree
zpe.sumelectthermalfe: -539.025554 hartree
dipole: -2.5136 0.7565 -0.0151
dipole: 2.6250
quadrupole: -56.4766 -70.7310 -76.8015
quadrupole: 1.7914 0.0599 0.0181
quadrupole: 11.5265 -2.7280 -8.7985 1.7914 0.0599 0.0181
hfenergy: -539.2051136 hartree
pointgroup: C01 [X(C10H14O2)]
dipole: 1.0105887 0.2126869 0.0072183 debye
dipolederiv: -0.2522495 -0.186388 -0.0016386 -0.1783795 -1.2233944 -0.0073553 -0.0013392 -0.007513 -0.3815463 -0.762071 0.5918369 0.0071375 0.6933558 -0.8256553 -0.0020729 0.0092948 -0.003468 -0.4344907 0.2498646 -0.0566215 -0.0006375 -0.1224299 0.1020728 -0.0001517 -0.001549 -0.0003 0.1317603 0.3170664 0.1391609 0.00087 -0.0276883 -0.1077909 0.0000098 -0.0006549 -0.000073 -0.1164145 -0.0472836 0.0676746 0.0007324 0.0489825 -0.0365555 -0.0010842 0.0008022 -0.0010723 0.0535779 -0.0610607 0.0117612 0.0266119 0.0508066 -0.0315393 0.0504698 -0.0379668 0.0518351 -0.0171581 -0.0608808 0.0122377 -0.0263632 0.0496335 -0.0293108 -0.0508609 0.039208 -0.0522152 -0.0190937 -0.1607318 0.3810484 0.0034747 0.2077304 0.989881 0.008294 0.0015966 0.008799 0.0408088 -0.095099 -0.0764732 -0.0006272 0.0001197 -0.0141485 0.0014885 0.0001669 0.0016126 -0.1599193 0.6434642 -0.7277875 -0.0068926 -0.538934 0.5008363 0.0036558 -0.0052232 0.004038 0.0140993 -0.0197118 0.0578045 0.0004535 -0.0269083 0.0213197 0.001528 -0.0003801 0.0011795 -0.1660477 -0.0617843 -0.0199385 -0.0002218 0.1067709 -0.114451 0.0007818 0.0010262 0.0005512 -0.1881267 -0.1966717 -0.0233449 0.000406 -0.1035458 0.0758268 0.0000715 -0.0002592 -0.0001016 0.0936199 0.0981135 -0.0408394 -0.0552804 -0.0028758 -0.0228363 -0.1053375 -0.038901 -0.1238025 -0.0886161 0.0984119 -0.0411731 0.0536994 -0.0030306 -0.0270714 0.1064851 0.037877 0.1252483 -0.0849155 0.0921847 -0.0354628 -0.0485553 -0.0148161 0.0136718 -0.1307673 -0.0313892 -0.0718397 -0.1192216 -0.2263537 -0.0796525 0.0332723 -0.0669539 0.0825828 0.0169818 0.0073178 0.0102338 0.0687086 0.1090418 0.0993637 -0.0329777 0.0679134 -0.0530204 0.0427002 -0.0367522 -0.0025694 0.0899417 -0.2262754 -0.0793026 -0.0340133 -0.0672904 0.0829321 -0.0165915 -0.0077695 -0.0096671 0.0682825 0.0924946 -0.0361266 0.0470127 -0.0148814 0.0095129 0.1335596 0.0303272 0.0744702 -0.1152491 0.1085453 0.0988816 0.0349361 0.0674261 -0.0520456 -0.0456683 0.0380218 -0.0004236 0.0889381 0.0475992 0.1017222 0.0009138 0.1054516 -0.0122931 -0.0013824 0.0009656 -0.0014652 0.13468 0.0446408 -0.0619156 -0.0004677 -0.0755059 -0.105812 -0.002237 -0.0006656 -0.0021549 0.1640551 -0.1425074 -0.016274 -0.0000796 0.0045456 0.0846713 -0.0007445 0.0000888 -0.0007467 0.176278 0.1946528 0.039884 0.0006207 0.035935 0.4124412 0.0005629 0.0002549 0.0006722 0.3628194 0.216601 -0.1200756 -0.0023859 -0.1954312 0.280176 -0.0023354 -0.0040978 -0.0012277 0.4032297 unknown
polarizability: 144.2361586|0.6782188|123.6078032|0.0006516|0.4444118|71.8896084 unknown
InChI: InChI=1S/C10H14O2/c1-10(2,3)7-5-4-6-8(11)9(7)12/h4-6,11-12H,1-3H3
charge 0 multiplicity 1
26 atoms
O  0.131764 -2.110174 -0.016146
O  2.719146 -1.641667 -0.012552
C  -1.958724 -0.006513 0.004396
C  -0.44062 0.291392 0.005317
C  -2.805616 1.293099 0.01841
C  -2.32789 -0.836956 1.272069
C  -2.331114 -0.811911 -1.278222
C  0.518806 -0.757124 -0.004336
C  0.074477 1.617459 0.016683
C  1.909973 -0.475012 -0.001989
C  1.458493 1.896298 0.018715
C  2.399008 0.841311 0.009253
H  -3.877879 1.024581 0.01868
H  -2.614045 1.901981 0.921566
H  -2.618764 1.918253 -0.874551
H  -2.092669 -0.27046 2.192357
H  -3.412002 -1.058946 1.271316
H  -1.775322 -1.789685 1.295591
H  -3.414943 -1.035349 -1.27835
H  -2.099632 -0.226744 -2.187699
H  -1.777438 -1.763253 -1.322213
H  -0.624657 2.45686 0.024649
H  1.806699 2.934239 0.027377
H  3.477404 1.042569 0.010712
H  0.958807 -2.663661 -0.020957
H  3.680737 -1.423686 -0.004178
