program: Gaussian 09
title: 000077642
version: EM64L-G09RevD.01
frameworkgroup: C1[X(C2H2Cl2O3S)]
method: RPBEPBE
basis: SDD
operation: Freq
keyword: #p
keyword: freq=noraman
keyword: PBEPBE/SDD
title: #p freq=noraman PBEPBE/SDD
converged: YES YES NO NO
title: Mulliken charges:
elementType: Cl Cl S O O O C C H H
charge: -0.176729 -0.006348 0.937495 -0.434976 -0.435167 -0.042484 -0.571996 0.049352 0.340406 0.340446
chargesum: 0.00000
title: Mulliken charges with hydrogens summed into heavy atoms:
elementType: Cl Cl S O O O C C
charge: -0.176729 -0.006348 0.937495 -0.434976 -0.435167 -0.042484 0.108856 0.049352
polarizability: 1.12660740e+02 3.09717257e+00 8.79422151e+01 2.62864701e-02 -8.29843069e-03 5.42668701e+01
1716.lowfreq: -10.6808 -6.5984 -3.4700 0.0031 0.0032 0.0038 37.3763 50.5729 76.1131
frequency: 37.2825 50.5068 76.1084 151.6260 163.8743 193.9480 225.7838 233.8788 360.6842 396.0869 404.8100 457.2323 559.7464 701.4347 838.5679 859.2408 945.1360 981.4177 1134.5549 1224.7968 1363.3437 1766.8249 3061.9402 3151.5561
redmass: 11.2979 5.7055 21.3283 14.5787 11.3608 14.8644 3.9422 23.4064 12.1727 17.5000 26.3180 3.2732 7.9799 8.9905 17.6059 2.0384 4.4308 7.4045 1.1342 1.2824 1.0944 11.9636 1.0571 1.1089
irintensity: 2.6490 7.5646 2.7087 2.3272 2.9107 0.6591 0.3190 0.4247 51.2735 23.7486 140.3183 0.0266 9.4926 58.3569 51.3489 0.0563 123.2516 61.8628 2.7584 0.6304 35.2133 177.6032 11.0342 12.6292
temp: 298.150 k
press: 1.00000 atm
elementType: 17 17 16 8 8 8 6 6 1 1
symmnumber: 1
zpe: 115681.2 jmol-1
zpe.correction: 0.044061 hartree
zpe.thermalcorrener: 0.054015 hartree
zpe.thermalcorrenthalpy: 0.054960 hartree
zpe.thermalcorrgfe: 0.006149 hartree
zpe.sumelectzpe: -1620.470689 hartree
zpe.sumelectthermal: -1620.460735 hartree
zpe.sumelectthermalent: -1620.459790 hartree
zpe.sumelectthermalfe: -1620.508601 hartree
dipole: 2.2156 -2.9472 0.0142
dipole: 3.6871
quadrupole: -76.9255 -72.6860 -70.3559
quadrupole: -1.5972 0.0238 0.0059
quadrupole: -3.6030 0.6365 2.9665 -1.5972 0.0238 0.0059
hfenergy: -1620.5147501 hartree
pointgroup: C01 [X(C2H2Cl2O3S1)]
dipole: 0.8794896 -1.1524153 -0.0525684 debye
dipolederiv: -0.5254855 -0.1753249 -0.013755 -0.3679327 -0.5527275 -0.0236456 -0.0254056 -0.021636 -0.2243708 -0.9692231 0.3791967 0.0128356 0.3475108 -0.4266888 -0.0160453 0.0119334 -0.0156544 -0.0820957 1.3740044 0.1805978 0.0138927 0.1236926 1.4103727 0.0201684 0.0106815 0.0208509 1.1050622 -0.4629097 -0.0121868 0.036721 0.1149304 -0.4682136 0.0271665 0.0012424 0.1275017 -0.4716589 -0.4623019 -0.0052349 -0.03756 0.11528 -0.4506831 -0.022441 0.013022 -0.1255383 -0.490786 -0.4349942 -0.0040251 -0.0025782 0.1441578 -0.9047267 -0.0404276 0.0056405 -0.0417203 -0.1512098 0.0978823 -0.0548507 -0.0008345 -0.4611508 -0.2311206 -0.0143498 -0.0236057 -0.0100183 -0.0517232 1.4333715 -0.3468502 -0.0081569 -0.0948401 1.3916288 0.067916 0.0045498 0.0649152 0.1564779 -0.0253487 0.0200833 -0.0105165 0.0373568 0.1157257 0.0091228 0.0326146 -0.0012376 0.1056328 -0.0249951 0.0185949 0.0099516 0.0409954 0.1164331 -0.0074643 -0.030673 0.002537 0.1046715 unknown
polarizability: 112.6110352|3.2250455|87.8696877|0.7930436|1.9740536|54.3891019 unknown
InChI: InChI=1S/C2H2ClO3S.Cl/c3-2(4)1-7(5)6;/h1H2;
charge 0 multiplicity 1
10 atoms
Cl -2.686932 -1.703031 -0.11192
Cl 3.095857 -1.14466 -0.018065
S  -1.262167 0.259856 0.02085
O  -1.397252 1.106684 -1.344039
O  -1.430102 0.940934 1.471921
O  1.750967 1.249209 0.101521
C  0.376249 -0.813565 -0.022167
C  1.617464 0.039812 0.034268
H  0.276671 -1.47899 0.849896
H  0.292245 -1.383149 -0.961066
