program: Gaussian 09
title: 000077652
version: EM64L-G09RevD.01
frameworkgroup: C1[X(C14H14S2)]
method: RPBEPBE
basis: SDD
operation: Freq
keyword: #pfreq=noraman
keyword: PBEPBE/SDD
title: #p freq=noraman PBEPBE/SDD
converged: YES YES NO NO
title: Mulliken charges:
elementType: S S C C C C C C C C C C C C C C H H H H H H H H H H H H H H
charge: 0.054097 0.036461 0.509802 0.487837 -0.397215 -0.366452 -0.401226 -0.399467 -0.194173 -0.180078 -0.806726 -0.805778 -0.217858 -0.216617 -0.233993 -0.234433 0.235834 0.234735 0.261075 0.258469 0.253997 0.250711 0.218827 0.240850 0.266053 0.217934 0.229672 0.230075 0.234150 0.233435
chargesum: 0.00000
title: Mulliken charges with hydrogens summed into heavy atoms:
elementType: S S C C C C C C C C C C C C C C
charge: 0.054097 0.036461 0.509802 0.487837 -0.397215 -0.366452 -0.165392 -0.164732 0.066902 0.078391 -0.083190 -0.080942 0.011814 0.013459 0.000156 -0.000998
polarizability: 2.54532531e+02 3.82155625e+00 1.86032064e+02 2.00082563e+01 -5.97799403e-01 1.40781339e+02
1716.lowfreq: -18.4460 -12.3446 -0.0023 -0.0016 -0.0009 6.9935 12.0807 18.0398 31.1459
frequency: -13.8838 16.2494 31.0748 59.5962 76.8028 80.4984 127.6864 145.5221 175.3053 234.1670 235.1131 246.7106 269.7643 347.4275 358.9083 371.6826 422.1091 427.3732 447.7787 450.0641 514.8982 516.6882 540.6584 541.3390 661.1161 661.6994 716.6070 717.8881 762.0954 762.3107 792.4497 795.9981 871.7420 874.3953 953.7553 954.0749 984.5916 984.9311 991.9063 992.4683 1018.6737 1022.2882 1042.3840 1043.1730 1046.6968 1047.5216 1127.0955 1128.1644 1172.7039 1173.0037 1210.1649 1212.2457 1272.7821 1275.0440 1363.8386 1365.0950 1398.6987 1400.3352 1415.2987 1415.9341 1453.4588 1456.1999 1457.7708 1460.5537 1470.9549 1475.9787 1569.7041 1570.2781 1593.5334 1594.4590 2980.3899 2987.9114 3060.4629 3072.4000 3091.5499 3092.6748 3122.7544 3123.4692 3136.7362 3137.2190 3150.2876 3151.0163 3166.8822 3167.2187
redmass: 2.3890 4.5972 4.1463 1.3917 5.5846 4.6688 1.1248 2.8512 3.6971 4.8943 3.7907 5.1406 4.6142 5.3597 5.2696 10.6768 4.2087 3.9804 2.9816 3.1521 3.6227 3.6238 5.7202 5.5592 6.3827 6.3747 2.9304 3.0191 1.2815 1.2720 4.8560 4.8425 1.2961 1.2886 1.3751 1.3766 1.5385 1.5362 1.3377 1.3414 5.9309 5.8362 2.1972 2.2110 1.5666 1.5634 1.5493 1.5498 1.0604 1.0607 2.3294 2.3207 1.4908 1.4884 7.8655 7.9009 1.2424 1.2358 1.9270 1.9726 1.1973 2.1823 2.0860 1.0879 1.1408 1.1153 5.7870 5.8365 6.1855 6.2421 1.0375 1.0369 1.0956 1.0969 1.1001 1.1000 1.0864 1.0862 1.0892 1.0894 1.0943 1.0943 1.1006 1.1004
irintensity: 0.0212 0.1880 0.3287 0.8417 0.4484 0.5838 0.5654 0.3689 1.7620 0.9907 3.4428 0.9043 6.9739 0.1751 1.8919 1.0964 5.2741 9.5125 7.7529 6.9720 1.0196 1.0547 0.3945 0.3179 0.4179 2.9316 8.8955 8.2419 38.6977 93.9389 0.9521 1.1028 0.0097 0.4218 0.1069 0.6403 0.6620 0.2966 0.0859 0.0830 1.0263 2.0484 4.9841 2.4036 5.3701 15.7441 5.4171 4.3135 2.0632 0.8518 9.3003 6.5453 3.3253 1.3236 3.5401 2.9296 26.0919 9.5588 1.4614 1.0367 19.4998 16.2747 19.7428 8.4005 15.7714 22.7251 1.1699 0.9587 7.3284 3.1948 19.2805 17.4268 12.3250 8.5911 17.7264 22.2800 4.2913 5.6507 11.0886 11.2146 20.4928 22.7141 31.5016 21.6471
temp: 298.150 k
press: 1.00000 atm
elementType: 16 16 6 6 6 6 6 6 6 6 6 6 6 6 6 6 1 1 1 1 1 1 1 1 1 1 1 1 1 1
symmnumber: 1
zpe: 614943.1 jmol-1
zpe.correction: 0.234219 hartree
zpe.thermalcorrener: 0.249673 hartree
zpe.thermalcorrenthalpy: 0.250617 hartree
zpe.thermalcorrgfe: 0.189308 hartree
zpe.sumelectzpe: -1336.874462 hartree
zpe.sumelectthermal: -1336.859009 hartree
zpe.sumelectthermalent: -1336.858064 hartree
zpe.sumelectthermalfe: -1336.919374 hartree
dipole: 0.1038 2.8243 0.6092
dipole: 2.8911
quadrupole: -97.4022 -105.2142 -108.0141
quadrupole: -0.5407 7.6686 -0.2895
quadrupole: 6.1413 -1.6707 -4.4706 -0.5407 7.6686 -0.2895
hfenergy: -1337.1086819 hartree
pointgroup: C01 [X(C14H14S2)]
dipole: -0.0194229 -1.1053066 -0.2678342 debye
polarizability: 253.453244|-6.7725246|186.5511628|-21.5638379|1.6829409|141.3415274 unknown
InChI: InChI=1S/C14H14S2/c1-11-7-3-5-9-13(11)15-16-14-10-6-4-8-12(14)2/h3-10H,1-2H3
charge 0 multiplicity 1
30 atoms
S  0.851132 1.806331 1.233652
S  -0.623034 2.110323 -0.555697
C  2.843171 0.446959 -0.292983
C  -1.982877 -0.370914 -0.858935
C  1.834098 0.347046 0.71356
C  -1.942358 0.886611 -0.183038
C  3.598834 -0.718371 -0.579969
C  -3.066815 -1.237974 -0.560932
C  1.597705 -0.874316 1.394449
C  -2.947149 1.248299 0.749186
C  3.092702 1.735503 -1.047903
C  -0.93109 -0.786605 -1.870593
C  3.37403 -1.93608 0.103743
C  -4.068356 -0.882899 0.370688
C  2.372216 -2.017077 1.0975
C  -4.011315 0.366171 1.031046
H  4.379353 -0.664815 -1.348261
H  -3.120712 -2.207329 -1.070506
H  0.805907 -0.91545 2.149285
H  -2.882986 2.221756 1.245849
H  2.22314 1.9936 -1.681692
H  3.233417 2.583352 -0.353731
H  3.98188 1.652299 -1.695511
H  -0.93082 -0.115608 -2.749072
H  0.082788 -0.740259 -1.436966
H  -1.113277 -1.816116 -2.223258
H  3.979316 -2.816594 -0.139818
H  -4.889753 -1.577958 0.578519
H  2.190547 -2.956453 1.630511
H  -4.784894 0.651067 1.752077
