program: Gaussian 09
title: 000086423
version: EM64L-G09RevD.01
frameworkgroup: C1[X(C16H25FN4O3)]
method: RPBEPBE
basis: SDD
operation: Freq
keyword: #p
keyword: freq=noraman
keyword: PBEPBE/SDD
title: #p freq=noraman PBEPBE/SDD
converged: YES YES NO NO
title: Mulliken charges:
elementType: F O O O N N N N C C C C C C C C C C C C C C C C H H H H H H H H H H H H H H H H H H H H H H H H H
charge: -0.220922 -0.262125 -0.439918 -0.271197 -0.220036 -0.097442 -0.083012 -0.168604 -0.031385 -0.521384 -0.036912 -0.077333 -0.374623 -0.089220 0.017380 -0.067730 -0.036844 -0.380039 0.083355 -0.665431 -0.662422 -0.690168 -0.688722 -0.128998 0.292224 0.251820 0.302229 0.208997 0.286141 0.219781 0.211943 0.327134 0.198414 0.184554 0.257083 0.352928 0.232732 0.216620 0.227529 0.224565 0.216370 0.232725 0.207053 0.273434 0.207979 0.206469 0.209846 0.273836 0.291328
chargesum: 0.00000
title: Mulliken charges with hydrogens summed into heavy atoms:
elementType: F O O O N N N N C C C C C C C C C C C C C C C C
charge: -0.220922 -0.262125 -0.086989 -0.271197 -0.220036 -0.097442 -0.083012 -0.168604 0.260839 0.032666 0.172084 0.208808 0.057101 0.237913 0.017380 0.130684 0.147711 -0.122956 0.083355 0.011449 0.011238 -0.001703 0.001429 0.162329
polarizability: 3.46054063e+02 8.44059793e+00 2.14189684e+02 8.04567316e+00 -1.69478410e+00 1.48394100e+02
1716.lowfreq: -11.3295 -4.4200 -0.0010 -0.0009 -0.0008 4.8004 9.5495 13.2006 22.5142
frequency: -7.0588 13.0067 22.3917 44.0378 50.7185 55.2124 61.7049 83.6136 93.8055 123.3018 131.6432 158.4111 166.9556 173.2174 191.5301 201.2888 211.4201 218.5764 234.5617 241.1084 251.3125 270.2199 273.6507 277.5294 287.0635 313.5578 323.5282 349.7958 358.0081 379.9538 402.9927 438.7121 445.5964 459.1078 486.2865 502.9169 533.5306 540.4225 560.3473 603.8036 619.6108 693.7323 703.1969 725.4340 737.6441 753.0581 765.9438 786.1333 810.5290 816.4081 838.7926 855.5283 906.3784 916.9914 921.8275 925.6607 933.6726 934.7956 941.4349 945.5201 963.9486 984.7552 989.3629 1016.2852 1028.1676 1037.7304 1045.1466 1056.1919 1072.3746 1075.1064 1109.2284 1123.7448 1130.7420 1144.4099 1147.6824 1156.4045 1174.8763 1182.5780 1196.0016 1198.6622 1223.7092 1230.8332 1234.8733 1242.1981 1264.4092 1277.9123 1299.5529 1305.6292 1310.1640 1314.3258 1323.9181 1340.4703 1344.6308 1347.9764 1363.7210 1367.7421 1383.3246 1384.0756 1399.7048 1404.0685 1418.0608 1432.6815 1440.2694 1453.3097 1461.7191 1469.1420 1469.4297 1471.4808 1477.3651 1482.4648 1485.1167 1486.6868 1500.0809 1569.3817 1583.5467 1627.2275 2940.1724 2984.6301 2985.0896 2986.7983 2988.6817 2992.2262 2998.3768 3016.9153 3044.8240 3045.2272 3059.9454 3069.7461 3076.4738 3081.6866 3082.4020 3088.0804 3090.4838 3091.3986 3094.4012 3109.5853 3115.1053 3131.9174 3151.9618 3205.2783 3572.7914
redmass: 4.0239 2.7593 5.1441 5.0941 5.6856 4.2680 2.9136 4.6293 3.8158 5.9653 4.2881 5.2947 4.8150 4.2930 3.9732 1.1091 1.1023 2.9983 1.3560 1.0693 3.0714 1.2562 2.9810 2.5493 3.2501 5.0539 4.7612 2.6169 2.8523 5.9510 3.5756 3.3245 4.1854 3.3225 2.8401 3.1713 3.8662 4.1950 8.4349 3.7345 4.9334 4.5335 3.8393 5.7507 3.9040 6.5444 4.0629 3.6749 3.4242 1.5550 3.4981 3.1373 2.3141 1.2052 1.1757 3.6877 2.7222 1.4172 1.4633 5.2124 4.6807 2.0273 1.3294 1.4768 3.3239 2.9019 3.7317 2.9959 1.8541 2.1108 1.7381 1.9282 2.2979 2.4115 3.1149 2.3846 1.3807 2.4982 2.4181 1.1619 1.2313 2.3080 1.6655 1.3614 1.6633 1.3422 1.4993 1.3921 1.4032 1.3678 1.4039 1.3580 1.2593 1.3305 1.5835 1.2063 1.2188 1.2669 1.6997 1.6170 1.4149 2.4246 1.0897 1.0418 1.0449 1.0507 1.0525 1.0773 1.0619 1.0507 1.2911 2.6525 1.0688 5.0290 6.7987 7.4149 1.0547 1.0354 1.0357 1.0413 1.0360 1.1063 1.0795 1.0852 1.0758 1.0884 1.0776 1.0881 1.1000 1.0993 1.1001 1.1009 1.0990 1.0885 1.1002 1.1002 1.0996 1.1000 1.0939 1.0964 1.0667
irintensity: 2.2230 0.2880 1.2475 1.7060 3.3269 3.0352 0.2519 15.0804 1.4182 2.9201 1.7756 2.3367 7.7589 6.7184 7.5320 1.2887 0.6102 13.6520 1.8252 0.1661 11.2948 140.9868 19.5157 2.9971 20.1297 18.6179 1.7661 1.2652 4.6971 1.5558 7.0339 13.9156 1.0515 1.2713 4.5853 25.1584 6.3966 20.7585 7.6304 3.5229 1.0319 11.7097 11.4330 9.1741 2.5832 6.1404 3.3889 1.4349 11.9637 58.5724 30.8236 0.6181 4.5759 0.5534 6.3028 65.4510 41.9338 0.0558 0.1300 48.1417 50.3495 28.4157 7.4546 3.9676 1.7602 105.1333 82.7279 118.1600 20.3392 8.8839 66.7848 26.0258 1.0279 19.1583 8.0050 24.6472 4.0986 142.3573 28.1379 53.1602 19.5943 227.4085 88.2455 10.5626 157.1198 8.4884 143.1582 2.9397 116.3565 8.2625 27.6165 11.6123 14.2665 76.3109 25.4759 25.5867 35.9369 54.9627 114.3973 232.2565 0.7037 158.6643 17.5401 0.7188 2.5097 8.1161 18.3541 7.7413 56.2484 2.3518 67.4226 354.5627 7.2738 985.9004 556.8376 204.9378 43.1186 11.4465 47.4446 27.6064 15.0799 65.7519 31.8508 38.7386 15.2264 26.9757 31.8500 6.6814 16.2643 62.5900 1.5162 23.9383 83.1694 16.7457 33.2828 1.5664 24.5200 3.1710 25.5916 1.0977 7.2266
temp: 298.150 k
press: 1.00000 atm
elementType: 9 8 8 8 7 7 7 7 6 6 6 6 6 6 6 6 6 6 6 6 6 6 6 6 1 1 1 1 1 1 1 1 1 1 1 1 1 1 1 1 1 1 1 1 1 1 1 1 1
symmnumber: 1
zpe: 1053287.6 jmol-1
zpe.correction: 0.401176 hartree
zpe.thermalcorrener: 0.425839 hartree
zpe.thermalcorrenthalpy: 0.426783 hartree
zpe.thermalcorrgfe: 0.345341 hartree
zpe.sumelectzpe: -1167.346366 hartree
zpe.sumelectthermal: -1167.321703 hartree
zpe.sumelectthermalent: -1167.320758 hartree
zpe.sumelectthermalfe: -1167.402201 hartree
dipole: 4.8722 4.1178 4.4851
dipole: 7.7981
quadrupole: -117.9906 -147.4918 -139.7489
quadrupole: -14.1647 -15.2576 4.6890
quadrupole: 17.0865 -12.4147 -4.6718 -14.1647 -15.2576 4.6890
hfenergy: -1167.7475416 hartree
pointgroup: C01 [X(C16H25F1N4O3)]
dipole: 1.9001122 2.4087449 0.0131816 debye
polarizability: 345.8853707|12.9018952|177.1887819|-0.075899|-32.6326045|185.5636941 unknown
InChI: InChI=1S/C16H25FN4O3/c1-10(2)21(11(3)4)9-18-14-5-6-20(16(23)19-14)15-7-12(17)13(8-22)24-15/h5-6,9-13,15,22H,7-8H2,1-4H3
charge 0 multiplicity 1
49 atoms
F  -6.282265 -0.774708 1.404747
O  -4.120854 -0.458801 -0.728312
O  -4.133792 2.256056 -1.678299
O  -1.266601 -1.888824 1.923377
N  -1.849408 -0.538607 0.106768
N  4.386338 0.235366 0.33469
N  0.460584 -0.730476 0.806735
N  2.147091 0.470049 -0.429232
C  -3.263032 -1.007962 0.317725
C  -3.85341 -0.545831 1.681545
C  -5.163932 0.17127 1.320774
C  -4.988812 0.594492 -0.146758
C  -4.377332 2.001308 -0.254822
C  -1.493735 0.276208 -0.947761
C  -0.855226 -1.103564 1.013207
C  5.301101 -0.3845 1.358064
C  4.975711 1.136103 -0.717014
C  -0.166192 0.625517 -1.134637
C  0.808853 0.096705 -0.215026
C  5.254105 -1.929941 1.313153
C  5.019863 0.166367 2.776288
C  4.442904 2.583467 -0.597874
C  4.777599 0.556783 -2.137752
C  3.053764 -0.029533 0.414025
H  -3.259341 -2.104761 0.215714
H  -3.155442 0.133691 2.197888
H  -4.03536 -1.400774 2.347657
H  -5.423383 1.001906 2.000915
H  -5.934022 0.551371 -0.711062
H  -3.434177 2.067248 0.328981
H  -5.106403 2.728698 0.163465
H  -2.309314 0.608179 -1.598457
H  6.319184 -0.068599 1.06405
H  6.06179 1.152294 -0.50132
H  0.147385 1.26675 -1.958267
H  -3.803244 3.181783 -1.79587
H  4.267798 -2.316834 1.625064
H  6.011614 -2.348035 2.000551
H  5.464082 -2.301796 0.294889
H  5.080337 1.268974 2.792064
H  5.760018 -0.234178 3.49253
H  4.014917 -0.129204 3.12739
H  4.963312 3.229092 -1.328801
H  3.361385 2.60372 -0.805341
H  4.621899 2.991179 0.413617
H  5.288419 1.20286 -2.875037
H  5.202912 -0.460176 -2.215739
H  3.704153 0.51395 -2.380414
H  2.741759 -0.699682 1.232324
