program: Gaussian 09
title: 000077714
version: EM64L-G09RevD.01
frameworkgroup: C1[X(C10H20O5P2S2)]
method: RPBEPBE
basis: SDD
operation: Freq
keyword: #p
keyword: freq=noraman
keyword: PBEPBE/SDD
title: #p freq=noraman PBEPBE/SDD
converged: YES YES NO NO
title: Mulliken charges:
elementType: S S P P O O O O O C C C C C C C C C C H H H H H H H H H H H H H H H H H H H H
charge: -0.194389 -0.194376 0.972749 0.972742 -0.440733 -0.442516 -0.440731 -0.442523 -0.746704 0.230138 0.230135 -0.339102 -0.347652 -0.339105 -0.347651 -0.672182 -0.714089 -0.672182 -0.714089 0.245340 0.240277 0.239085 0.250779 0.245335 0.240279 0.239084 0.250782 0.210544 0.210490 0.248233 0.228053 0.225001 0.223329 0.248232 0.210545 0.210489 0.228054 0.225001 0.223328
chargesum: 0.00000
title: Mulliken charges with hydrogens summed into heavy atoms:
elementType: S S P P O O O O O C C C C C C C C C C
charge: -0.194389 -0.194376 0.972749 0.972742 -0.440733 -0.442516 -0.440731 -0.442523 -0.746704 0.230138 0.230135 0.146514 0.142212 0.146509 0.142216 -0.002915 -0.037706 -0.002915 -0.037705
polarizability: 2.41268773e+02 -2.94901624e+01 2.30502999e+02 -7.72380443e-04 -6.30596866e-04 1.46882913e+02
1716.lowfreq: -0.0023 -0.0020 -0.0019 2.7621 3.0391 13.1383 16.3037 42.7847 43.7717
frequency: 15.8798 42.6597 43.5846 63.6613 66.7710 103.2114 110.5533 120.8648 155.0775 162.4377 169.9427 174.9086 182.2857 184.7590 206.5719 216.5305 217.1444 246.8201 260.3652 275.4114 276.5308 286.2056 299.5711 327.8603 354.8806 369.0201 371.9311 384.7670 384.7800 396.6596 396.7115 434.8746 444.9440 445.0519 531.2851 559.9229 562.8939 614.3525 667.8280 679.7883 713.7928 719.7330 755.7019 767.9462 767.9898 869.4912 869.4941 903.8187 903.9930 908.2806 908.9590 929.5111 933.2680 933.3834 937.2443 945.6862 946.1661 1017.7722 1017.8490 1022.6952 1023.4408 1166.5587 1166.6226 1189.7823 1189.8407 1190.3110 1190.6592 1276.1958 1276.3745 1303.2099 1303.3308 1328.7499 1329.0393 1355.6150 1356.5414 1383.4333 1383.4914 1404.1157 1404.1798 1450.9543 1451.0701 1456.6712 1456.9110 1466.1949 1466.2235 1474.8727 1475.1802 1480.7898 1480.8141 1487.4873 1487.5748 2977.2095 2977.2206 2985.1095 2985.1634 2991.3102 2991.6403 3006.1166 3006.3970 3074.0400 3074.0553 3075.5712 3075.5759 3079.6877 3079.7310 3092.7198 3092.7666 3096.7737 3096.7848 3098.2726 3098.4840
redmass: 6.4715 4.6006 4.6338 6.9249 4.5650 3.6571 8.0582 4.5123 5.2269 2.4404 1.3179 1.4480 2.9659 4.5059 7.4944 1.1906 1.0964 3.5365 2.7184 2.8442 3.5368 5.4554 4.5602 9.9153 8.3648 3.4920 3.3720 2.5321 2.4811 2.0807 2.0384 11.3541 4.2559 4.2690 8.4926 4.8115 5.1830 13.5633 8.8497 8.9569 9.8476 9.6347 12.9108 4.0083 4.2595 6.1307 5.9686 2.4464 2.2803 2.0864 2.0813 3.8927 1.4362 1.4413 3.6134 1.5038 1.6647 1.4006 1.3972 1.6707 1.6874 1.8667 1.8656 1.9213 1.9100 1.2305 1.2384 2.3007 2.2944 1.8623 1.8602 1.1923 1.1903 1.2621 1.2610 1.1899 1.1901 1.1942 1.1935 1.0778 1.0780 1.0644 1.0642 1.0466 1.0466 1.0764 1.0781 1.0564 1.0563 1.0617 1.0617 1.0355 1.0355 1.0370 1.0370 1.0632 1.0631 1.0615 1.0615 1.0999 1.0999 1.1002 1.1002 1.0995 1.0995 1.1029 1.1029 1.0995 1.0996 1.1044 1.1043
irintensity: 3.7738 0.0505 3.6418 0.5819 0.3908 0.0900 0.0416 0.0304 0.1589 1.5541 0.2218 1.3147 0.0053 9.3825 8.9213 0.1753 0.1607 0.3816 3.5102 4.3740 0.0000 0.4017 11.9882 143.7136 4.8287 2.5919 2.9549 1.2840 0.3660 11.4997 0.4552 4.2256 0.5955 7.5755 81.9666 0.0790 24.2701 10.7478 17.9935 112.8563 8.9704 448.6927 467.7416 0.2392 159.1993 38.6272 4.1869 3.4133 16.2180 0.1388 5.6141 10.0301 1.2406 7.1786 552.1114 0.0328 74.4258 4.5809 0.9930 22.0241 0.0002 0.5994 0.0161 2.9312 0.0077 0.0447 0.3065 0.0845 0.1687 4.6429 0.0567 2.1294 6.2403 0.0211 3.1259 2.6425 44.5619 51.2577 0.3908 0.9588 12.4226 1.0575 0.0584 0.4952 0.0876 28.0702 3.4140 21.8491 0.1020 2.7724 44.4354 36.3910 3.0009 49.4338 0.7551 30.2120 12.0536 26.1302 26.5315 43.5452 2.6373 2.0239 1.3288 3.7630 62.4148 1.2777 34.1163 30.2307 4.7369 33.6116 1.7503
temp: 298.150 k
press: 1.00000 atm
elementType: 16 16 15 15 8 8 8 8 8 6 6 6 6 6 6 6 6 6 6 1 1 1 1 1 1 1 1 1 1 1 1 1 1 1 1 1 1 1 1
symmnumber: 1
zpe: 791885.6 jmol-1
zpe.correction: 0.301613 hartree
zpe.thermalcorrener: 0.324778 hartree
zpe.thermalcorrenthalpy: 0.325722 hartree
zpe.thermalcorrgfe: 0.249093 hartree
zpe.sumelectzpe: -2246.227211 hartree
zpe.sumelectthermal: -2246.204047 hartree
zpe.sumelectthermalent: -2246.203102 hartree
zpe.sumelectthermalfe: -2246.279731 hartree
dipole: -0.0001 -0.0003 1.0311
dipole: 1.0311
quadrupole: -109.4902 -162.7315 -149.1303
quadrupole: -15.2652 -0.0001 -0.0003
quadrupole: 30.9605 -22.2808 -8.6797 -15.2652 -0.0001 -0.0003
hfenergy: -2246.5288244 hartree
pointgroup: C01 [X(C10H20O5P2S2)]
dipole: 0.000023 -0.4056488 0.0001762 debye
polarizability: 241.8254982|-0.0087486|146.8829162|-29.3830919|0.0158486|229.9462712 unknown
InChI: InChI=1S/C10H20O5P2S2/c1-9(2)5-11-16(18,12-6-9)15-17(19)13-7-10(3,4)8-14-17/h5-8H2,1-4H3
charge 0 multiplicity 1
39 atoms
S  0.114714 0.014759 3.079229
S  -0.114923 0.013588 -3.07935
P  1.024692 -0.346671 1.290044
P  -1.024742 -0.347114 -1.289938
O  2.186818 -1.623848 1.296315
O  1.881615 0.990693 0.608898
O  -2.18692 -1.624247 -1.295621
O  -1.881523 0.990547 -0.609207
O  0.000058 -0.930988 0.000091
C  3.7801 -0.456345 -0.299012
C  -3.780083 -0.456046 0.299305
C  2.996857 -1.752964 0.036386
C  2.779905 0.698311 -0.566452
C  -2.9969 -1.752827 -0.035601
C  -2.779836 0.698677 0.566256
C  4.752101 -0.091748 0.847996
C  4.554246 -0.706643 -1.619738
C  -4.752112 -0.091868 -0.847812
C  -4.55419 -0.705782 1.620158
H  2.316267 -2.03858 -0.788845
H  3.677823 -2.588399 0.266062
H  3.301936 1.658323 -0.710956
H  2.142855 0.485571 -1.447249
H  -2.316283 -2.03813 0.789718
H  -3.677902 -2.588337 -0.264901
H  -3.301823 1.658774 0.710363
H  -2.142785 0.486276 1.447134
H  5.468414 -0.914394 1.028294
H  5.33015 0.815179 0.59236
H  4.210542 0.100514 1.789721
H  3.874028 -0.975744 -2.449539
H  5.115939 0.197267 -1.918347
H  5.284939 -1.526227 -1.493201
H  -4.210581 0.100012 -1.789632
H  -5.468455 -0.914563 -1.027767
H  -5.330126 0.815175 -0.592505
H  -3.873955 -0.974577 2.450045
H  -5.115843 0.198267 1.918423
H  -5.284918 -1.525391 1.493977
