program: Gaussian 09
title: 000077628
version: EM64L-G09RevD.01
frameworkgroup: C1[X(C8H20N2)]
method: RPBEPBE
basis: SDD
operation: Freq
keyword: #pfreq=noraman
keyword: PBEPBE/SDD
title: #p freq=noraman PBEPBE/SDD
converged: YES YES NO NO
title: Mulliken charges:
elementType: N N C C C C C C C C H H H H H H H H H H H H H H H H H H H H
charge: -0.304410 -0.304500 -0.379231 -0.379462 -0.015747 -0.015758 -0.675040 -0.716525 -0.674864 -0.716577 0.158860 0.230374 0.230327 0.158916 0.175009 0.175019 0.241488 0.241541 0.201749 0.223262 0.217341 0.204053 0.212525 0.226392 0.201725 0.223246 0.217274 0.204074 0.212561 0.226377
chargesum: 0.00000
title: Mulliken charges with hydrogens summed into heavy atoms:
elementType: N N C C C C C C C C
charge: -0.062922 -0.062959 0.010004 0.009781 0.159261 0.159261 -0.032688 -0.073556 -0.032619 -0.073564
polarizability: 1.30775955e+02 9.75581150e-03 9.07476954e+01 -6.06788990e-01 -1.83110318e-02 9.32134857e+01
1716.lowfreq: -3.0288 -0.0003 0.0004 0.0006 2.2488 9.8192 21.9382 42.8809 73.0048
frequency: 21.8504 42.8287 72.9909 91.7688 101.5961 152.4253 187.0208 209.5604 217.0370 236.5723 248.7406 254.3303 335.8513 360.9535 402.7895 423.2704 458.1989 491.1679 510.5122 659.4598 667.2021 817.2648 822.8194 828.9114 916.0497 916.3255 938.3196 948.2856 950.5267 967.9586 1053.2167 1081.1055 1089.4455 1101.3265 1138.8475 1154.1068 1162.7295 1168.2259 1183.9334 1195.1684 1210.1413 1266.0842 1292.1275 1317.2486 1331.7118 1336.1679 1343.2116 1370.5360 1372.9106 1387.2340 1387.8682 1391.2544 1448.2909 1449.8633 1467.2221 1467.5814 1469.1301 1469.9831 1477.2715 1478.4046 1484.7894 1488.8336 1492.8570 1498.8802 2812.2626 2819.3013 2832.7267 2833.2834 2972.3297 2972.4357 2981.3934 2981.5537 3040.4548 3055.4376 3064.3930 3064.6100 3076.7777 3077.1034 3084.5269 3084.5890 3089.6609 3089.7055 3414.1277 3414.6393
redmass: 2.5246 3.0926 3.1913 1.6703 3.1424 1.9727 2.1776 1.0563 1.4430 2.3919 1.0939 1.1800 2.8415 2.1968 2.2597 2.3799 2.1299 2.7900 2.4714 1.5058 1.3741 2.2617 1.1864 2.4405 1.1892 1.1796 1.7583 1.3971 1.5232 1.9097 3.3972 1.6502 2.5081 2.3625 1.9041 2.3076 2.0321 1.7744 2.0211 2.1377 1.4604 1.1317 1.1903 1.3467 1.3987 1.4224 1.3932 1.2411 1.2466 1.2749 1.2239 1.3851 1.1536 1.1341 1.0712 1.0629 1.0979 1.0782 1.0802 1.0968 1.0670 1.0583 1.0609 1.0865 1.0726 1.0727 1.0808 1.0806 1.0362 1.0362 1.0353 1.0353 1.0827 1.0897 1.0983 1.0981 1.0990 1.0989 1.1001 1.1001 1.0996 1.0997 1.0737 1.0737
irintensity: 0.0555 0.1251 0.6794 4.3281 1.6664 3.0809 0.2761 0.4308 0.0022 0.1451 0.2595 0.4371 0.9541 0.0103 0.1077 0.1749 29.6700 14.0143 0.3395 140.2607 20.5407 7.2161 0.4729 1.0163 6.3738 1.5601 0.3869 0.0014 1.5294 0.0490 0.6084 22.2148 15.7829 2.7708 2.3137 52.8716 23.5561 1.1699 0.7353 72.0561 3.5596 18.1640 13.5898 0.1989 49.8672 6.0601 38.4923 26.7264 22.0988 5.8100 37.5747 8.8684 18.9571 30.2851 7.0710 1.3256 0.0014 5.5189 3.3006 18.1244 1.0785 12.3739 2.3743 16.5512 138.7152 42.9154 161.5774 120.3266 47.6708 28.3610 19.8840 21.8765 12.3407 31.5356 11.0024 80.8547 78.4073 1.6911 33.0524 2.8047 42.6607 93.4037 1.9877 5.5302
temp: 298.150 k
press: 1.00000 atm
elementType: 7 7 6 6 6 6 6 6 6 6 1 1 1 1 1 1 1 1 1 1 1 1 1 1 1 1 1 1 1 1
symmnumber: 1
zpe: 718008.3 jmol-1
zpe.correction: 0.273475 hartree
zpe.thermalcorrener: 0.287283 hartree
zpe.thermalcorrenthalpy: 0.288227 hartree
zpe.thermalcorrgfe: 0.232238 hartree
zpe.sumelectzpe: -425.463755 hartree
zpe.sumelectthermal: -425.449947 hartree
zpe.sumelectthermalent: -425.449003 hartree
zpe.sumelectthermalfe: -425.504992 hartree
dipole: 0.0017 -1.8277 -0.0124
dipole: 1.8277
quadrupole: -62.1806 -64.9866 -66.4117
quadrupole: -0.0105 1.6637 0.0089
quadrupole: 2.3457 -0.4603 -1.8854 -0.0105 1.6637 0.0089
hfenergy: -425.7372298 hartree
pointgroup: C01 [X(C8H20N2)]
dipole: 0.0006714 -0.0009587 -0.7190785 debye
polarizability: 130.7856261|-0.0699059|93.2039491|0.007014|-0.0016948|90.7475612 unknown
InChI: InChI=1S/C8H20N2/c1-7(2)9-5-6-10-8(3)4/h7-10H,5-6H2,1-4H3
charge 0 multiplicity 1
30 atoms
N  -1.84414 -0.40736 -0.193757
N  1.844099 0.407221 -0.195476
C  -0.633238 0.437995 -0.149557
C  0.633232 -0.43803 -0.149315
C  -3.146687 0.311507 -0.20175
C  3.146761 -0.31146 -0.200321
C  -3.43206 0.939286 1.180609
C  -4.257122 -0.68582 -0.590191
C  3.432173 -0.933394 1.184693
C  4.257076 0.684414 -0.592788
H  -0.581092 1.162198 -1.007408
H  -0.638777 1.0423 0.774331
H  0.639421 -1.040977 0.775456
H  0.580511 -1.163533 -1.006032
H  -3.140979 1.138612 -0.959632
H  3.141347 -1.141711 -0.954747
H  -1.793435 -1.072474 -0.979804
H  1.793803 1.07003 -0.983471
H  -4.413135 1.449268 1.178436
H  -3.439641 0.150138 1.953884
H  -2.666379 1.685421 1.45864
H  -4.081431 -1.112932 -1.596898
H  -5.243569 -0.189265 -0.601389
H  -4.290141 -1.517638 0.137153
H  4.413103 -1.44367 1.184578
H  3.44006 -0.140947 1.954576
H  2.666321 -1.67811 1.466045
H  4.081551 1.107128 -1.601378
H  5.243632 0.188037 -0.601567
H  4.289737 1.519367 0.130979
