program: Gaussian 09
title: 000077632
version: EM64L-G09RevD.01
frameworkgroup: C1[X(C7H8O4S)]
method: RPBEPBE
basis: SDD
operation: Freq
keyword: #pfreq=noraman
keyword: PBEPBE/SDD
title: #p freq=noraman PBEPBE/SDD
converged: YES YES NO NO
title: Mulliken charges:
elementType: S O O O O C C C C C C C H H H H H H H H
charge: 0.982881 -0.399006 -0.551325 -0.481287 -0.538506 -0.221298 0.381687 0.182594 -0.238066 -0.380143 -0.222963 -0.766725 0.276372 0.243229 0.243387 0.249647 0.249256 0.215635 0.387112 0.387519
chargesum: 0.00000
title: Mulliken charges with hydrogens summed into heavy atoms:
elementType: S O O O O C C C C C C C
charge: 0.982881 -0.011893 -0.163807 -0.481287 -0.538506 -0.221298 0.381687 0.182594 0.038305 -0.136914 0.020424 -0.052186
polarizability: 1.53010967e+02 -1.55508022e+00 1.24279707e+02 1.17542809e+00 -6.86328529e-01 6.88007312e+01
1716.lowfreq: -10.3104 -0.0012 0.0017 0.0026 5.1980 9.2140 41.4495 89.9504 112.5645
frequency: 41.4332 89.9372 112.5619 149.4538 168.9288 181.2349 225.1406 250.3779 268.7656 290.1308 308.1811 335.9126 346.1741 426.0189 467.5386 494.1829 534.0728 544.1406 557.4477 600.9162 725.7407 770.7182 782.8234 792.6352 808.2012 828.0156 912.6598 942.4426 972.4177 985.3254 1049.6948 1057.3294 1084.8134 1108.4635 1175.1808 1233.0114 1257.7468 1348.8541 1400.6982 1408.5625 1420.2621 1452.1956 1473.8065 1488.8841 1579.1728 1603.8538 2989.5385 3016.6739 3069.6218 3100.7021 3138.6204 3155.3798 3177.3214 3471.0767
redmass: 5.8119 4.0773 1.1199 4.5766 6.6748 1.9468 3.7014 3.1745 4.3297 4.5437 4.4413 8.7277 7.9338 9.0544 4.8470 5.1759 5.2219 3.3962 9.7285 7.4735 3.9430 1.3437 2.4677 1.6315 7.0469 5.1133 1.3172 9.6786 1.3483 1.6471 1.5281 1.1957 1.8853 2.9585 1.1871 2.7220 2.2967 1.9893 1.2673 2.1850 2.4486 1.0444 1.1470 2.8257 4.7173 6.2570 1.0365 1.0688 1.0968 1.1008 1.0892 1.0903 1.0994 1.0660
irintensity: 1.6985 0.8575 1.0334 3.7844 1.5453 38.1007 8.5370 24.1321 19.2702 22.4488 34.1700 7.3979 6.3808 53.4671 0.4997 41.0214 17.5150 0.6153 122.6054 18.8458 40.4390 50.4074 27.6280 125.2988 54.0659 2.5234 0.4418 102.6713 0.1834 10.4956 4.3247 84.4606 17.8778 31.8344 5.6977 16.2281 87.7084 63.2625 38.5136 7.8414 75.0993 14.0317 25.7202 11.7305 13.1034 17.2088 24.4222 322.8815 11.3841 14.1175 10.9224 2.4004 10.2040 51.5266
temp: 298.150 k
press: 1.00000 atm
elementType: 16 8 8 8 8 6 6 6 6 6 6 6 1 1 1 1 1 1 1 1
symmnumber: 1
zpe: 365907.7 jmol-1
zpe.correction: 0.139367 hartree
zpe.thermalcorrener: 0.151807 hartree
zpe.thermalcorrenthalpy: 0.152752 hartree
zpe.thermalcorrgfe: 0.100778 hartree
zpe.sumelectzpe: -969.429160 hartree
zpe.sumelectthermal: -969.416720 hartree
zpe.sumelectthermalent: -969.415776 hartree
zpe.sumelectthermalfe: -969.467749 hartree
dipole: 2.5726 1.8282 1.2862
dipole: 3.4081
quadrupole: -69.4377 -77.3567 -82.6352
quadrupole: 2.6355 -7.5824 -0.2935
quadrupole: 7.0388 -0.8802 -6.1586 2.6355 -7.5824 -0.2935
hfenergy: -969.5685271 hartree
pointgroup: C01 [X(C7H8O4S1)]
dipole: -1.07594 0.6092768 -0.5186609 debye
dipolederiv: 1.98187 0.0093847 -0.1365157 -0.0024512 1.2092584 -0.0002347 -0.3586009 -0.0058373 1.6573388 -0.5158037 0.297002 -0.0006849 0.2266814 -1.0649506 0.0664598 -0.0370582 0.0347138 -0.351895 -0.5744086 -0.0299187 0.2805127 -0.0124386 -0.5263702 -0.0078427 0.4107578 0.0017374 -0.9581977 -0.7198807 -0.0607981 -0.0508547 -0.111701 -0.5109394 -0.1065161 -0.0068421 -0.0377624 -0.512812 -0.7270729 -0.016809 0.0358728 -0.0143515 -0.7180086 0.1112752 0.0470194 0.0344994 -0.51636 -0.2787551 -0.1355592 0.0049674 0.1354286 -0.2160092 0.0132594 -0.1456504 0.0074055 -0.1934715 0.1247742 0.5488372 -0.0425873 0.1306372 -0.0127897 0.003008 -0.0051269 0.0133135 -0.0398898 0.0745398 -0.5573856 0.0387561 0.0890527 0.8949865 -0.0820908 0.0031898 -0.083462 0.0968461 0.0254 0.1268824 -0.0047223 -0.4318585 -0.0466737 0.0014135 0.0594296 0.0107926 -0.0832506 0.1888227 -0.0131941 0.003183 0.0180179 0.1370991 -0.0221378 -0.0006516 -0.0206972 -0.1277487 -0.2977002 -0.1885751 0.022829 -0.0002521 0.0055258 -0.0133863 0.0166855 -0.0143757 -0.1609446 0.0183162 -0.0922008 0.008069 -0.1147684 -0.1218099 0.0101091 0.0062983 0.017001 0.0489316 0.0680122 -0.0697938 -0.0007404 -0.0385369 0.0873025 0.0087104 -0.0065337 -0.003556 0.1570682 -0.1031765 0.0390737 -0.0030729 0.0219548 0.0981343 0.0036603 -0.0006185 0.0003726 0.1462239 0.0392851 0.0499767 -0.0027778 0.0452306 -0.069326 0.0158548 -0.0148261 0.0171821 0.1740629 0.0666753 -0.0060508 0.0447484 -0.0352044 0.0208435 -0.0898066 -0.0066131 -0.1063506 -0.0080945 0.0683643 -0.0107691 -0.0453831 -0.0325508 0.0478261 0.0833904 0.0114163 0.0980549 -0.0334056 -0.1341502 0.0178828 0.0008019 0.1134491 0.0445054 0.0043591 -0.008017 0.0048118 0.1097335 0.5725386 0.0622964 -0.0410622 -0.0026499 0.3921335 -0.0172484 0.0235411 0.0288536 0.332188 0.1223497 0.0297183 -0.111339 0.016311 0.349262 0.0177633 0.0122006 0.0033031 0.263677 unknown
polarizability: 152.6442787|3.2952859|124.3317294|-2.2925679|-4.0038528|69.1153971 unknown
InChI: InChI=1S/C7H8O4S/c1-5-3-2-4-6(7(5)8)12(9,10)11/h2-4,8-9H,1H3
charge 0 multiplicity 1
20 atoms
S  2.044382 -0.000455 0.002596
O  -0.376139 -2.028628 0.183841
O  2.341823 0.079903 -1.823054
O  2.950395 1.131991 0.705929
O  2.21513 -1.567058 0.469919
C  0.233281 0.37824 -0.012975
C  -2.093183 -0.36151 0.029176
C  -0.700867 -0.6942 0.063888
C  -0.134218 1.735829 -0.114112
C  -2.460072 0.994956 -0.075535
C  -1.504669 2.042707 -0.139657
C  -3.107063 -1.480395 0.110011
H  0.632587 2.51543 -0.158235
H  -3.527463 1.242211 -0.099957
H  -1.830154 3.084173 -0.2131
H  -2.979057 -2.191495 -0.726098
H  -2.972628 -2.068254 1.035912
H  -4.135736 -1.084279 0.085129
H  0.630391 -2.150601 0.29498
H  3.329261 -0.006165 -1.97296
