program: Gaussian 09
title: 000077654
version: EM64L-G09RevD.01
frameworkgroup: C1[X(C15H15BrN2O3)]
method: RPBEPBE
basis: SDD
operation: Freq
keyword: #p
keyword: freq=noraman
keyword: PBEPBE/SDD
title: #p freq=noraman PBEPBE/SDD
converged: YES YES NO NO
title: Mulliken charges:
elementType: Br O O O N N C C C C C C C C C C C C C C C H H H H H H H H H H H H H H H
charge: 0.062109 -0.278928 -0.414093 -0.423907 -0.267147 -0.474628 0.218104 0.327526 -0.301152 -0.342032 0.384522 0.110809 -0.631220 -0.632568 -0.260389 -0.228608 -0.594482 -0.505296 0.443336 0.478825 -0.643101 0.371661 0.230754 0.306799 0.228598 0.244627 0.197955 0.226433 0.216200 0.250132 0.225273 0.228108 0.279177 0.244111 0.351452 0.371040
chargesum: 0.00000
title: Mulliken charges with hydrogens summed into heavy atoms:
elementType: Br O O O N N C C C C C C C C C C C C C C C
charge: 0.062109 -0.278928 -0.062641 -0.052867 -0.267147 -0.102967 0.218104 0.327526 -0.070397 -0.035233 0.384522 0.110809 0.039961 0.060197 -0.035116 -0.000499 -0.315305 -0.261185 0.443336 0.478825 -0.643101
polarizability: 3.54342109e+02 -7.24287668e+00 2.22342549e+02 -1.14181015e+01 -4.86708270e+00 9.75023871e+01
1716.lowfreq: -8.9129 -5.2806 -0.5951 0.0004 0.0006 0.0007 10.1782 28.3836 41.4281
frequency: 9.7343 28.3473 41.3940 52.5143 75.1761 103.1634 122.3342 139.1511 162.2740 170.1382 185.3051 213.1245 232.7919 237.9898 244.0505 255.0923 262.7500 291.3885 298.7845 339.9172 352.7505 374.5599 385.6431 443.6888 458.4531 484.8332 500.6619 511.5334 530.7722 544.4067 560.1330 566.6793 572.3142 585.9458 601.9123 710.8302 717.3751 733.3654 753.9328 769.5727 783.0103 834.8859 846.8702 872.3422 880.4545 891.1673 927.6217 950.6285 952.3181 991.9174 1000.2215 1005.4536 1033.9152 1036.7342 1084.4592 1085.8184 1104.6059 1142.1842 1151.3776 1168.0582 1171.7420 1177.8905 1182.9090 1204.4397 1233.9640 1260.6235 1296.5024 1303.2446 1340.7186 1382.3411 1402.6392 1421.6661 1425.6325 1432.9597 1449.0093 1457.5709 1461.5936 1474.0154 1478.1586 1487.5623 1496.8784 1511.0425 1570.2635 1594.6280 1600.0720 1608.0428 1613.7836 2908.5602 2921.5923 3033.9548 3035.3656 3091.6788 3100.0197 3129.0125 3135.7690 3142.4990 3158.5865 3161.1840 3193.0947 3364.1280 3474.7370 3584.3619
redmass: 5.3850 7.3169 4.3506 3.7069 8.6322 5.7318 3.7821 4.3371 7.9165 7.3796 5.7706 1.3231 3.9024 2.2693 1.3660 4.7190 4.9612 5.1667 3.7446 4.6288 3.4235 3.8551 1.2024 7.2756 1.0879 3.5256 4.4910 4.7034 6.5604 5.6521 7.0644 5.4718 3.7485 4.4024 5.0428 5.6044 3.1234 4.2285 2.6521 1.5166 6.9613 1.4730 4.7957 1.3162 1.4126 1.8186 3.7825 1.4195 5.4846 1.3055 5.8157 7.4547 1.9693 1.7003 1.3392 2.1140 1.7112 1.4422 1.6505 1.4415 1.0850 1.2860 2.8943 2.2717 1.8155 1.4374 2.0451 2.3574 5.7473 6.4889 6.7580 1.1385 3.6477 1.6810 1.8427 1.6159 1.1493 1.1311 1.1411 2.4746 1.1198 2.5838 8.3497 5.3562 6.6429 6.5221 7.6746 1.0513 1.0480 1.0807 1.0843 1.1010 1.1005 1.0854 1.0915 1.0912 1.0919 1.0983 1.0952 1.0754 1.0648 1.0661
irintensity: 0.9453 0.2780 0.0488 1.6667 0.2968 2.9376 1.7720 0.9917 0.8564 1.2634 0.3195 3.3213 0.0920 5.0900 1.3257 5.7006 16.2639 16.0833 0.5922 3.5429 1.2340 12.2926 114.3086 12.5215 148.3756 18.3740 3.7106 17.0782 4.1230 3.7120 23.0928 8.4103 0.6932 2.1840 10.9534 1.7300 0.8909 14.6335 18.5101 67.0199 27.7523 21.1348 16.4910 30.0626 2.6467 64.0406 50.4416 6.9100 1.4853 2.8980 150.6865 76.2763 25.0718 11.8744 9.2512 10.9912 4.7846 6.0315 1.8616 108.8046 21.3960 314.5628 11.9765 28.7128 6.6387 25.8900 11.7805 20.9338 40.2466 102.8490 16.4783 9.8160 35.2031 128.2260 42.4530 78.1927 6.4592 42.8490 40.6540 117.1160 40.7664 459.1759 323.0968 46.0757 10.0653 5.2930 20.0872 88.2172 124.7746 25.1721 35.6030 17.6717 26.9055 0.7559 11.9379 19.8339 1.5397 32.9528 6.3348 113.4057 64.7605 57.4310
temp: 298.150 k
press: 1.00000 atm
elementType: 35 8 8 8 7 7 6 6 6 6 6 6 6 6 6 6 6 6 6 6 6 1 1 1 1 1 1 1 1 1 1 1 1 1 1 1
symmnumber: 1
zpe: 716821.9 jmol-1
zpe.correction: 0.273023 hartree
zpe.thermalcorrener: 0.293289 hartree
zpe.thermalcorrenthalpy: 0.294233 hartree
zpe.thermalcorrgfe: 0.221675 hartree
zpe.sumelectzpe: -927.711960 hartree
zpe.sumelectthermal: -927.691694 hartree
zpe.sumelectthermalent: -927.690750 hartree
zpe.sumelectthermalfe: -927.763308 hartree
dipole: 1.5553 2.7618 0.7901
dipole: 3.2667
quadrupole: -120.0827 -122.2363 -135.2576
quadrupole: 10.3305 0.1005 -0.3949
quadrupole: 5.7762 3.6225 -9.3988 10.3305 0.1005 -0.3949
hfenergy: -927.9849831 hartree
pointgroup: C01 [X(C15H15Br1N2O3)]
dipole: -0.6660241 1.0760051 -0.2244737 debye
polarizability: 352.9823659|14.4324675|222.0611829|-14.5095849|13.0287293|99.1434964 unknown
InChI: InChI=1S/C15H15BrN2O3/c1-18(2)11-6-4-3-5-10(11)17-15(21)9-7-12(19)14(16)13(20)8-9/h3-8,17,19-20H,1-2H3
charge 0 multiplicity 1
36 atoms
Br 6.033334 0.990733 0.025144
O  -0.011472 -2.474013 -0.266977
O  3.341575 2.507013 0.741736
O  5.02249 -1.820178 -0.735417
N  -2.442545 1.866689 -0.114013
N  -0.896625 -0.320438 -0.009421
C  -3.11562 0.58992 0.054384
C  -2.285742 -0.579796 0.055247
C  -4.509281 0.450129 0.226716
C  -2.867064 -1.867339 0.164989
C  1.537377 -0.61743 -0.063358
C  0.15102 -1.219453 -0.115409
C  -2.987839 2.996148 0.671236
C  -2.204628 2.22843 -1.540444
C  -5.088059 -0.833418 0.364042
C  -4.266651 -1.982654 0.315839
C  2.602296 -1.479454 -0.416358
C  1.805827 0.716041 0.324533
C  3.138348 1.185995 0.347384
C  3.933739 -1.015419 -0.395265
C  4.201228 0.321232 -0.01676
H  -0.718011 0.693397 0.071688
H  -5.145915 1.341747 0.244725
H  -2.218775 -2.745232 0.1416
H  -2.263164 3.829979 0.652272
H  -3.133792 2.683601 1.71816
H  -3.957014 3.382161 0.278464
H  -1.510884 3.086776 -1.593229
H  -3.147249 2.502086 -2.066183
H  -1.750562 1.376398 -2.073974
H  -6.171031 -0.933662 0.494234
H  -4.713646 -2.978744 0.405939
H  2.354037 -2.511214 -0.693072
H  1.032134 1.418776 0.647389
H  4.313201 2.722732 0.732548
H  4.721763 -2.73264 -0.972588
