program: Gaussian 09
title: 000077616
version: EM64L-G09RevD.01
frameworkgroup: C1[X(C7H6BrNO)]
method: RPBEPBE
basis: SDD
operation: Freq
keyword: #p
keyword: freq=noraman
keyword: PBEPBE/SDD
title: #p freq=noraman PBEPBE/SDD
converged: YES YES NO NO
title: Mulliken charges:
elementType: Br O N C C C C C C C H H H H H H
charge: 0.008449 -0.283489 -0.606891 0.320827 -0.322524 -0.319091 -0.186173 -0.228521 -0.222888 0.176894 0.295595 0.254010 0.240368 0.241522 0.295822 0.336091
chargesum: 0.00000
title: Mulliken charges with hydrogens summed into heavy atoms:
elementType: Br O N C C C C C C C
charge: 0.008449 -0.283489 0.025022 0.320827 -0.322524 -0.023496 0.067837 0.011847 0.018634 0.176894
polarizability: 1.35700949e+02 7.15571754e+00 1.21659811e+02 2.26709970e-01 7.53360764e-02 3.77796403e+01
1716.lowfreq: -0.0008 -0.0006 -0.0006 5.2678 7.6555 10.6363 14.8636 107.3653 186.9544
frequency: 14.7286 107.3635 186.9543 203.6875 268.3127 281.7512 399.1237 426.7980 477.2754 489.9114 567.1709 590.0679 605.9124 639.9792 687.7220 743.4625 747.7012 784.6106 888.9853 977.7735 990.0719 1014.1906 1037.1574 1071.3114 1107.2653 1138.0151 1173.3223 1257.1556 1351.6139 1365.5547 1414.5845 1448.0056 1552.4000 1575.2177 1599.4635 1629.0999 3140.0520 3150.8241 3164.1901 3176.8883 3482.7088 3646.1516
redmass: 5.7355 4.3816 13.2955 4.9933 8.4468 4.9626 6.7083 3.1269 3.4340 4.6608 1.1655 4.3573 1.3877 6.4886 3.0045 4.9943 2.3409 1.7100 1.3752 1.3609 7.5273 1.3445 2.8426 1.8792 2.1866 1.8024 1.0569 1.4074 5.0255 4.3497 2.3757 2.3984 4.6063 2.6036 5.4935 2.0386 1.0860 1.0902 1.0950 1.1003 1.0473 1.1029
irintensity: 11.2253 0.1658 1.9258 2.6274 2.0220 19.2039 8.4055 5.9446 4.4865 3.3413 78.0420 9.8877 136.8574 11.9448 64.3764 13.3592 70.3021 32.0748 1.4419 2.5893 61.8035 2.2138 6.3474 1.6610 3.5976 0.4547 2.0287 3.8084 101.8661 85.5791 56.6775 16.4933 49.6731 141.4315 9.4080 248.2060 5.3510 1.7501 8.4122 16.6555 59.2279 105.1085
temp: 298.150 k
press: 1.00000 atm
elementType: 35 8 7 6 6 6 6 6 6 6 1 1 1 1 1 1
symmnumber: 1
zpe: 302502.9 jmol-1
zpe.correction: 0.115217 hartree
zpe.thermalcorrener: 0.124174 hartree
zpe.thermalcorrenthalpy: 0.125118 hartree
zpe.thermalcorrgfe: 0.078705 hartree
zpe.sumelectzpe: -413.080612 hartree
zpe.sumelectthermal: -413.071656 hartree
zpe.sumelectthermalent: -413.070712 hartree
zpe.sumelectthermalfe: -413.117125 hartree
dipole: 1.5386 -2.3536 0.1260
dipole: 2.8147
quadrupole: -65.0363 -61.6226 -71.2880
quadrupole: 13.3557 -0.0740 0.3429
quadrupole: 0.9460 4.3597 -5.3057 13.3557 -0.0740 0.3429
hfenergy: -413.1958298 hartree
pointgroup: C01 [X(C7H6Br1N1O1)]
dipole: -0.6933689 -0.8460604 0.1724157 debye
dipolederiv: -0.2538379 0.2088482 -0.0909116 0.1802421 -0.5565372 0.163733 -0.0854182 0.1667328 -0.0852312 -0.7436323 -0.294712 0.027983 -0.1010816 -0.956468 0.1630153 -0.0307198 0.1282987 -0.4175592 -0.8508696 0.3025646 -0.1285864 0.250402 -0.675748 0.0444928 -0.1138409 0.0559191 -0.7002964 -0.5128403 0.0517055 -0.0999768 -0.1227035 -0.342409 0.0915559 -0.0500433 0.1182252 0.0244801 0.3701115 -0.5365122 0.2135452 -0.240136 0.9074813 -0.3051401 0.132913 -0.3526663 -0.0119697 0.0101212 -0.0055637 0.0183117 -0.0300997 -0.04628 -0.0191027 0.0291617 -0.0166236 -0.0949804 -0.2825848 0.1897783 -0.0783504 0.2348691 -0.1876708 0.0587229 -0.0909886 0.0536592 -0.1220415 -0.0377836 -0.1596896 0.0600235 -0.0971199 0.0103201 -0.0588033 0.0428051 -0.0684249 -0.130062 0.1138737 0.0619098 0.0207172 -0.0784299 0.0927892 -0.0715543 0.0580434 -0.0503734 -0.1119653 1.4931621 0.1169016 0.1735336 -0.072511 1.2395059 -0.3240161 0.2256839 -0.2876718 0.3562372 0.1582809 -0.0128877 0.0030212 -0.0013226 0.0431439 0.0298431 -0.0020821 0.0293504 0.1507408 0.0728892 -0.0475165 -0.0002449 -0.0670675 -0.0202905 0.0384737 0.0042919 0.0406317 0.1526323 0.0214129 0.077205 -0.0415465 0.0887983 -0.017952 0.0613448 -0.0444818 0.0592113 0.1398861 -0.0973596 -0.0152729 -0.034713 -0.0209612 0.0784225 0.0192175 -0.0335651 0.0202322 0.1526099 0.3338031 0.1022365 -0.0262786 0.1137659 0.2651261 0.0501988 -0.0270446 0.0462424 0.3353375 0.2052535 -0.0389948 -0.0165273 -0.0366446 0.1665665 0.0580186 -0.0147148 0.0572568 0.3621816 unknown
polarizability: 125.2881679|-6.1109141|123.3312301|15.0480869|-23.9393377|46.5210024 unknown
InChI: InChI=1S/C7H6BrNO/c8-6-4-2-1-3-5(6)7(9)10/h1-4H,9H2
charge 0 multiplicity 1
16 atoms
Br 0.496686 -2.475938 1.020233
O  2.037362 2.018463 0.02343
N  2.60882 -0.086792 0.755087
C  0.211261 0.433665 0.210159
C  -0.431477 -0.812122 0.445484
C  -0.632351 1.507636 -0.202975
C  -1.824675 -0.981861 0.282276
C  -2.0194 1.360584 -0.370488
C  -2.623214 0.106912 -0.126069
C  1.681243 0.834479 0.323395
H  -0.127482 2.462453 -0.384682
H  -2.280176 -1.957532 0.472664
H  -2.624836 2.215125 -0.688886
H  -3.702231 -0.032643 -0.24993
H  2.371895 -1.047475 1.003281
H  3.575974 0.231346 0.81502
