program: Gaussian 09
title: 000077623
version: EM64L-G09RevD.01
frameworkgroup: C1[X(C12H16N2)]
method: RPBEPBE
basis: SDD
operation: Freq
keyword: #pfreq=noraman
keyword: PBEPBE/SDD
title: #p freq=noraman PBEPBE/SDD
converged: YES YES NO YES
title: Mulliken charges:
elementType: N N C C C C C C C C C C C C H H H H H H H H H H H H H H H H
charge: 0.005524 0.005497 -0.403389 -0.403374 -0.483907 -0.483923 -0.000629 -0.000611 -0.000630 -0.000627 -0.483909 -0.483916 -0.403379 -0.403379 0.205835 0.211558 0.205837 0.211548 0.239916 0.227867 0.239925 0.227840 0.227854 0.239920 0.227852 0.239922 0.205834 0.211554 0.205835 0.211553
chargesum: 0.00000
title: Mulliken charges with hydrogens summed into heavy atoms:
elementType: N N C C C C C C C C C C C C
charge: 0.005524 0.005497 0.014005 0.014011 -0.016124 -0.016158 -0.000629 -0.000611 -0.000630 -0.000627 -0.016135 -0.016142 0.014009 0.014010
polarizability: 1.88973789e+02 1.00497451e-03 1.33176285e+02 -2.08916061e-03 1.83808583e+00 9.02145936e+01
1716.lowfreq: -20.3274 -0.0007 -0.0006 -0.0004 7.0223 7.7027 60.7037 62.2817 99.1128
frequency: 60.7037 62.2817 99.0551 195.6981 211.3881 213.0795 293.5855 304.3572 360.5572 366.4066 420.2486 434.4792 437.7268 463.9957 489.3903 542.8384 608.1961 625.1046 674.0739 686.0310 742.6913 743.4879 818.7489 835.1950 860.0602 873.8270 890.2583 902.6758 914.0377 929.9766 969.7332 987.8942 1079.2360 1081.9097 1087.8772 1091.1912 1122.3166 1132.5969 1140.2051 1156.8469 1156.9504 1172.1432 1236.3367 1236.5693 1237.9907 1245.9097 1254.3065 1255.3391 1286.8061 1322.0914 1330.3328 1334.4260 1338.8271 1338.8839 1343.8075 1358.1396 1391.4261 1414.7292 1442.6824 1449.8955 1451.2295 1456.6108 1472.1610 1473.8860 1476.5456 1476.5839 1512.5637 1525.0072 2969.4892 2969.8700 2970.2351 2970.2758 2979.0898 2979.3998 2980.8626 2980.9365 3038.5649 3038.7916 3040.8562 3041.5160 3044.5187 3044.7430 3052.4117 3052.6777
redmass: 2.9768 2.5927 2.2130 2.3867 4.0583 3.4898 1.6704 1.9723 3.1665 2.5354 3.6998 4.1237 4.4068 3.3568 2.4003 4.7145 3.4217 2.2481 2.8944 5.9635 2.8432 4.8331 1.5351 1.9371 2.4432 2.3229 1.5007 1.5026 2.4655 2.2441 2.6889 2.0475 1.9546 1.9656 1.7651 1.4870 1.1293 1.2541 2.4693 1.9896 1.4389 6.3931 1.3748 3.1056 1.5613 1.4133 1.2288 2.3948 1.3283 1.6593 1.3966 1.4724 1.4591 1.3983 1.4965 2.0434 5.3055 4.9775 1.1999 1.0816 1.0766 1.1522 1.1016 1.0981 1.0896 1.0926 9.2545 4.5309 1.0665 1.0669 1.0667 1.0668 1.0651 1.0654 1.0597 1.0596 1.0946 1.0946 1.0944 1.0943 1.0977 1.0975 1.1023 1.1023
irintensity: 0.6060 0.0017 0.0000 8.9998 1.8398 0.0000 0.3298 0.0000 0.0000 0.0000 0.0000 0.0000 1.7959 2.3181 4.8649 0.0000 0.0115 0.0000 3.4686 0.0000 0.0000 0.7347 21.3276 0.0000 0.0000 16.9560 9.6914 0.0000 9.0145 0.0000 0.0000 10.1648 0.0000 1.5852 0.0000 1.6060 2.1288 0.0000 0.0000 8.9096 0.0010 7.2139 0.0026 7.5207 1.7761 1.9724 0.0000 0.0000 8.9933 0.0000 0.2207 0.0000 2.2026 0.0009 7.8431 0.0000 181.2847 3.1430 0.0000 0.0000 52.6582 20.7896 0.0000 22.4833 17.6157 0.0128 0.0000 0.0000 0.0016 0.8627 51.5014 13.4840 71.5471 0.0352 0.2239 80.0760 0.0030 78.4103 123.8681 0.0011 19.8192 0.0009 0.0054 126.2283
temp: 298.150 k
press: 1.00000 atm
elementType: 7 7 6 6 6 6 6 6 6 6 6 6 6 6 1 1 1 1 1 1 1 1 1 1 1 1 1 1 1 1
symmnumber: 1
zpe: 676227.3 jmol-1
zpe.correction: 0.257561 hartree
zpe.thermalcorrener: 0.269214 hartree
zpe.thermalcorrenthalpy: 0.270158 hartree
zpe.thermalcorrgfe: 0.219868 hartree
zpe.sumelectzpe: -575.350728 hartree
zpe.sumelectthermal: -575.339075 hartree
zpe.sumelectthermalent: -575.338131 hartree
zpe.sumelectthermalfe: -575.388421 hartree
dipole: -0.0001 0.0002 0.0000
dipole: 0.0002
quadrupole: -70.7544 -88.8696 -82.7528
quadrupole: 0.0003 -0.0005 -0.1489
quadrupole: 10.0378 -8.0773 -1.9605 0.0003 -0.0005 -0.1489
hfenergy: -575.6082889 hartree
pointgroup: C01[X(C12H16N2)]
dipole: 0.0000222 -0.0000659 0.0000133 debye
polarizability: 188.9737894|0.0007278|133.1364014|0.0009546|-2.2561984|90.2544771 unknown
InChI: InChI=1S/C12H16N2/c1-2-6-10-9(5-1)13-11-7-3-4-8-12(11)14-10/h1-8H2
charge 0 multiplicity 1
30 atoms
N  -0.000013 -1.411709 0.090544
N  0.000012 1.411753 -0.090698
C  -3.698362 -0.697769 -0.332794
C  -3.69812 0.697919 0.333438
C  -2.463637 -1.513067 0.114459
C  -2.463638 1.513082 -0.114707
C  -1.174763 -0.712045 0.045383
C  -1.174746 0.712102 -0.045633
C  1.174734 -0.712073 0.045444
C  1.174749 0.712096 -0.045554
C  2.463618 -1.513076 0.114534
C  2.463647 1.51308 -0.114543
C  3.69825 -0.697832 -0.333059
C  3.698216 0.697832 0.333216
H  -3.689147 -0.575933 -1.434701
H  -4.621918 -1.250989 -0.078096
H  -3.688168 0.576152 1.435346
H  -4.62182 1.251165 0.079316
H  -2.340372 -2.430189 -0.490014
H  -2.602347 -1.855321 1.160927
H  -2.340155 2.430554 0.489177
H  -2.602827 1.854687 -1.161331
H  2.60251 -1.855066 1.161068
H  2.34027 -2.430339 -0.489702
H  2.602665 1.855014 -1.161079
H  2.340245 2.430372 0.489635
H  3.688735 -0.57599 -1.434964
H  4.621859 -1.251081 -0.078616
H  3.688561 0.575999 1.435122
H  4.621861 1.251071 0.078883
