program: Gaussian 09
title: 000077625
version: EM64L-G09RevD.01
frameworkgroup: C1[X(C8H5Cl3O3)]
method: RPBEPBE
basis: SDD
operation: Freq
keyword: #p
keyword: freq=noraman
keyword: PBEPBE/SDD
title: #p freq=noraman PBEPBE/SDD
converged: NO YES NO NO
title: Mulliken charges:
elementType: Cl Cl Cl O O O C C C C C C C C H H H H H
charge: 0.036942 0.000025 0.004003 -0.248003 -0.420321 -0.187994 0.592609 -0.228885 -0.304376 -0.098683 -0.213701 -0.225651 -0.333833 0.186106 0.266502 0.259028 0.259194 0.267456 0.389584
chargesum: 0.00000
title: Mulliken charges with hydrogens summed into heavy atoms:
elementType: Cl Cl Cl O O O C C C C C C C C
charge: 0.036942 0.000025 0.004003 -0.248003 -0.030738 -0.187994 0.592609 -0.228885 -0.304376 -0.098683 0.052801 0.041805 0.184389 0.186106
polarizability: 1.64468298e+02 -7.80441103e+00 1.41209489e+02 5.98406684e+00 2.91391366e+00 6.62831343e+01
1716.lowfreq: -4.2672 -0.0012 0.0014 0.0026 4.6836 5.4435 20.8015 25.3463 48.3878
frequency: 20.6521 25.3043 48.3870 63.5083 93.6338 122.4491 158.0717 189.7623 215.8938 256.0274 270.9152 296.9029 314.9861 383.9044 417.4804 463.3659 495.0646 522.4531 544.7053 575.5823 586.7293 619.9274 633.4748 735.7911 760.0998 799.5006 852.2686 872.1568 935.4112 985.1351 992.5435 1045.8001 1062.9026 1125.5367 1166.5716 1200.5659 1220.9041 1257.8150 1342.0435 1358.1902 1390.4796 1421.4821 1445.2206 1553.0662 1569.3814 1705.7759 2985.4747 3045.6558 3169.5691 3187.6627 3527.8549
redmass: 11.6631 9.4587 12.3580 2.5743 10.6345 8.4395 14.5308 30.7847 11.6038 12.6323 8.0474 7.5512 26.5246 8.3939 8.3629 5.8173 1.8312 4.6470 5.5710 5.6548 9.7820 1.4846 7.5637 8.7301 9.4232 1.3358 8.5787 4.2908 1.3337 6.6780 1.9922 3.3412 5.1339 1.7732 1.8052 1.0786 2.7729 1.6797 7.9405 3.0384 2.3505 2.5253 1.1036 7.6780 8.7073 9.4296 1.0557 1.1050 1.0888 1.0978 1.0643
irintensity: 0.2591 2.4999 0.8161 4.9051 0.7168 2.0778 0.0219 0.0144 0.9292 3.1823 1.4401 0.2207 0.1067 3.3454 20.1862 3.5917 39.5900 3.6121 27.5037 2.3877 20.0538 136.0767 15.0194 4.1325 45.0300 45.3413 31.8640 3.7352 0.0138 331.3890 15.1901 130.0237 27.3632 5.4174 31.4887 1.2060 63.7302 21.9180 16.4448 20.6553 64.8924 159.1502 15.0479 3.3147 6.8634 225.2693 30.9784 5.8799 0.0786 0.2069 36.2958
temp: 298.150 k
press: 1.00000 atm
elementType: 17 17 17 8 8 8 6 6 6 6 6 6 6 6 1 1 1 1 1
symmnumber: 1
zpe: 299270.0 jmol-1
zpe.correction: 0.113986 hartree
zpe.thermalcorrener: 0.128038 hartree
zpe.thermalcorrenthalpy: 0.128982 hartree
zpe.thermalcorrgfe: 0.069425 hartree
zpe.sumelectzpe: -1912.653455 hartree
zpe.sumelectthermal: -1912.639403 hartree
zpe.sumelectthermalent: -1912.638459 hartree
zpe.sumelectthermalfe: -1912.698016 hartree
dipole: 0.4325 1.3333 3.1730
dipole: 3.4688
quadrupole: -89.9399 -95.9023 -106.8444
quadrupole: 10.3893 -7.6642 -0.8087
quadrupole: 7.6223 1.6599 -9.2822 10.3893 -7.6642 -0.8087
hfenergy: -1912.7674412 hartree
pointgroup: C01 [X(C8H5Cl3O3)]
dipole: -0.2662113 -0.4781045 1.2502252 debye
dipolederiv: -0.1285423 -0.2161276 0.0301601 -0.1855857 -0.5556556 0.0793272 0.0110327 0.0585405 -0.0108004 -0.3175003 0.3237302 0.0283013 0.290578 -0.5308313 -0.0335313 0.0058673 -0.0177007 -0.0305672 -0.4073142 0.3283855 0.0265109 0.3791993 -0.4236205 -0.0229506 0.0392158 -0.0304406 -0.0267957 -1.3930903 -0.1149006 -0.1529276 -0.1721694 -0.3358857 -0.0249225 -0.148854 -0.0178819 -0.2572429 -0.8984716 -0.0909847 -0.5343997 -0.1097814 -0.4392762 -0.1113451 -0.5242626 -0.1008456 -0.8180275 -0.6800938 -0.0459012 0.2299599 -0.0723901 -0.2773555 0.0058061 -0.0321156 -0.0390742 -0.9150608 1.0703392 0.1688219 0.0160096 0.1297329 -0.1047989 0.0145242 -0.2042979 -0.0228303 0.0579453 -0.0805052 0.3198814 -0.0550016 0.5131858 0.690956 -0.1391978 -0.0366862 -0.0834918 -0.0404412 0.2955352 -0.4927768 -0.0755816 -0.5452465 0.7142832 0.0436398 -0.0343999 0.0203375 -0.0803484 0.5202006 -0.4961094 -0.0524698 -0.6980022 0.4882027 0.0644361 -0.0511207 0.0442786 -0.0352661 -0.0762087 0.0864703 -0.0116768 0.1077026 -0.1158709 -0.0219527 -0.0144557 -0.008098 -0.0860072 -0.1228789 0.0721163 -0.0097288 0.1337522 -0.1276256 -0.0181846 -0.0037768 -0.0101871 -0.1027201 0.403635 0.000538 0.273911 0.044692 0.3421829 0.0404491 0.7533411 0.0855496 0.2461757 1.4959513 0.2019024 0.1441154 0.2374667 0.2325392 0.0916093 0.2219828 0.1036478 1.4893152 0.0771553 -0.0195943 0.0126506 -0.0308189 -0.0089045 0.0146256 0.0167684 0.0142467 0.1661332 0.0248442 0.0272156 0.0143737 -0.0253057 -0.0096781 -0.0959672 -0.0766177 -0.0564889 0.0242255 0.0193746 -0.0184035 -0.0163304 0.02774 -0.0008783 0.0978741 -0.0976576 0.0370019 0.0116455 -0.0110661 -0.007984 0.0276975 -0.0017438 0.0766959 0.0060224 0.0269609 0.007142 0.1650431 0.208636 -0.0262795 0.104426 -0.0230057 0.3855212 0.0097378 0.1490758 0.0162945 0.2427941 unknown
polarizability: 160.5998057|-11.6634|145.0426968|-6.5853508|-1.8966713|66.3184193 unknown
InChI: InChI=1S/C8H5Cl3O3/c9-4-1-2-5(10)8(7(4)11)14-3-6(12)13/h1-2,12H,3H2
charge 0 multiplicity 1
19 atoms
Cl -0.534874 2.500279 -0.332366
Cl 0.283125 -2.985245 -0.128865
Cl -3.734855 2.017413 0.199427
O  1.031294 -0.068236 -0.543026
O  4.186621 0.546966 1.165674
O  3.714229 0.34871 -1.110719
C  -0.314824 -0.264317 -0.211334
C  -1.206712 0.839601 -0.127447
C  -0.842503 -1.568053 -0.041587
C  -2.58288 0.625913 0.100076
C  -2.214189 -1.785208 0.183112
C  -3.089029 -0.680942 0.25374
C  1.925395 0.12885 0.605646
C  3.331876 0.34392 0.069306
H  -2.597057 -2.802032 0.301012
H  1.62404 1.015734 1.196214
H  1.921238 -0.760019 1.266162
H  -4.157992 -0.83136 0.425056
H  5.116397 0.688426 0.840519
