program: Gaussian 09
title: 000077627
version: EM64L-G09RevD.01
frameworkgroup: C1[X(C15H12O3)]
method: RPBEPBE
basis: SDD
operation: Freq
keyword: #pfreq=noraman
keyword: PBEPBE/SDD
title: #p freq=noraman PBEPBE/SDD
converged: YES YES NO NO
title: Mulliken charges:
elementType: O O O C C C C C C C C C C C C C C C H H H H H H H H H H H H
charge: -0.321851 -0.221187 -0.209186 0.198591 0.301964 -0.325370 -0.365338 0.283721 0.161821 -0.262161 -0.202006 0.157189 -0.345188 -0.336432 -0.798499 -0.222462 -0.220443 -0.224053 0.246495 0.259075 0.234436 0.237321 0.268148 0.270853 0.235791 0.241347 0.263590 0.232223 0.230234 0.231377
chargesum: 0.00000
title: Mulliken charges with hydrogens summed into heavy atoms:
elementType: O O O C C C C C C C C C C C C C C C
charge: -0.321851 -0.221187 -0.209186 0.198591 0.301964 -0.078874 -0.106264 0.283721 0.161821 -0.027725 0.035315 0.157189 -0.077040 -0.065579 -0.057772 0.009761 0.009791 0.007325
polarizability: 2.53416919e+02 -1.61530847e+01 1.46855404e+02 9.03466039e+00 9.01783654e+00 1.19150120e+02
1716.lowfreq: -8.4623 -3.0953 -0.0005 -0.0004 -0.0004 4.4865 25.4030 34.1145 47.8200
frequency: 25.3952 34.0218 47.8119 58.6399 100.9118 128.2618 152.9307 171.0783 175.4736 229.3203 249.7474 290.6329 333.1559 401.5584 402.6758 423.3387 427.4505 431.5763 485.1503 503.3902 573.6370 594.8810 595.9904 614.1704 653.3390 662.1392 693.1964 697.6999 727.2096 759.9486 785.0618 794.7733 823.7931 862.2448 878.9137 943.6342 952.5259 957.0509 984.9828 991.6475 992.9587 993.9391 1007.1932 1023.9992 1029.0726 1034.5416 1064.0417 1085.0087 1121.4216 1172.6456 1173.7746 1176.2201 1187.5957 1236.9638 1260.3758 1272.3959 1314.7711 1369.0792 1380.9293 1391.0997 1428.7816 1438.6193 1449.4922 1465.0307 1466.8967 1478.5950 1564.2123 1589.0993 1599.3052 1610.0720 1613.1031 1659.2641 2986.9496 3073.3032 3126.0349 3129.6871 3138.8744 3142.8329 3153.6058 3155.3182 3167.5029 3167.9625 3177.6047 3183.0022
redmass: 4.3861 4.7568 5.4298 5.3516 4.7106 5.4849 5.5506 6.2691 1.0789 4.9261 5.4507 6.7642 4.7824 7.9394 2.8266 3.6875 4.9956 4.3288 4.5023 3.5914 6.8740 4.5479 3.0661 6.4367 5.2375 5.6300 4.4593 1.7853 4.6486 1.6669 2.1528 2.4157 6.0002 1.2463 1.4730 2.4427 1.4229 1.3840 7.2192 5.4159 1.3834 1.3947 1.3323 1.8138 2.0699 2.8285 2.1368 1.5663 1.8683 1.5516 1.1252 1.1357 1.4876 3.6029 3.6582 1.5287 1.3167 1.2872 7.8704 10.1423 2.1818 2.2456 1.1308 1.0821 2.2758 2.3407 5.8763 6.4370 8.1438 6.5450 6.2181 12.3865 1.0375 1.0974 1.0989 1.0855 1.0859 1.0893 1.0903 1.0942 1.0986 1.0943 1.1001 1.0967
irintensity: 2.8425 1.6212 2.5287 2.4683 0.4300 0.3513 0.2016 0.9284 0.4799 1.8394 0.6264 5.6736 4.2032 2.6103 0.0310 1.6164 1.0790 0.9402 1.2841 7.3050 9.2906 10.5369 4.8814 1.0336 28.5434 16.3453 1.9412 73.2996 9.2658 45.6469 37.2144 35.9147 5.8500 0.0850 1.7389 57.4418 3.5364 2.3103 371.6119 35.2918 5.2125 0.2363 0.2349 2.5549 16.7404 11.1423 47.7521 10.0813 63.6130 232.6929 50.2848 44.3273 47.8833 153.5054 205.3238 23.0444 0.7021 36.8570 18.5143 3.3325 17.0002 17.3126 37.0441 15.8594 30.7783 6.5492 67.6092 12.0644 183.1961 43.1031 5.9040 203.2891 4.1562 10.7493 12.3301 0.2541 1.1222 11.6386 11.6187 19.8969 28.8870 13.7669 13.6985 5.4253
temp: 298.150 k
press: 1.00000 atm
elementType: 8 8 8 6 6 6 6 6 6 6 6 6 6 6 6 6 6 6 1 1 1 1 1 1 1 1 1 1 1 1
symmnumber: 1
zpe: 597370.4 jmol-1
zpe.correction: 0.227526 hartree
zpe.thermalcorrener: 0.243163 hartree
zpe.thermalcorrenthalpy: 0.244107 hartree
zpe.thermalcorrgfe: 0.182769 hartree
zpe.sumelectzpe: -803.212942 hartree
zpe.sumelectthermal: -803.197306 hartree
zpe.sumelectthermalent: -803.196361 hartree
zpe.sumelectthermalfe: -803.257700 hartree
dipole: 1.9594 -1.0011 -1.3473
dipole: 2.5800
quadrupole: -72.6566 -97.9095 -106.1752
quadrupole: 1.6147 0.1678 2.0332
quadrupole: 19.5905 -5.6624 -13.9281 1.6147 0.1678 2.0332
hfenergy: -803.4404687 hartree
pointgroup: C01 [X(C15H12O3)]
dipole: 0.7730266 0.3847464 0.5336246 debye
polarizability: 252.7376411|17.9428111|146.6235452|-10.3034607|9.6290353|120.061256 unknown
InChI: InChI=1S/C15H12O3/c1-11(16)13-9-5-6-10-14(13)18-15(17)12-7-3-2-4-8-12/h2-10H,1H3
charge 0 multiplicity 1
30 atoms
O  0.055846 0.826089 0.223039
O  0.355062 -1.929192 0.309828
O  -0.355272 -0.054417 -1.912547
C  2.220121 -0.40881 -0.000035
C  1.460563 0.801422 0.052031
C  3.633504 -0.278385 -0.121665
C  2.086333 2.063715 0.012938
C  -2.193042 0.173623 -0.317725
C  1.597965 -1.772109 0.126994
C  4.266689 0.97793 -0.172365
C  3.488778 2.156732 -0.095804
C  -0.785166 0.25071 -0.783874
C  -3.179403 -0.224889 -1.257444
C  -2.565315 0.472579 1.018006
C  2.50651 -2.998224 0.050598
C  -4.529396 -0.31921 -0.864875
C  -3.917921 0.376489 1.406007
C  -4.901328 -0.017455 0.467408
H  4.248476 -1.181563 -0.171997
H  1.456633 2.957086 0.060668
H  5.355558 1.040099 -0.26715
H  3.968279 3.140753 -0.129614
H  -2.866662 -0.459569 -2.280274
H  -1.793849 0.766129 1.734318
H  3.26177 -2.997504 0.858181
H  3.044204 -3.039227 -0.914616
H  1.879815 -3.897078 0.149827
H  -5.289719 -0.627871 -1.590306
H  -4.206612 0.60348 2.437971
H  -5.951122 -0.091932 0.773076
