program: Gaussian 09
title: 000077622
version: EM64L-G09RevD.01
frameworkgroup: C1[X(C8H19P)]
method: RPBEPBE
basis: SDD
operation: Freq
keyword: #pfreq=noraman
keyword: PBEPBE/SDD
title: #p freq=noraman PBEPBE/SDD
converged: YES YES NO NO
title: Mulliken charges:
elementType: P C C C C C C C C H H H H H H H H H H H H H H H H H H H
charge: 0.340416 -0.025630 -0.034283 -0.743365 -0.736045 -0.688699 -0.687005 -0.677574 -0.685735 0.209667 0.199460 0.250417 0.244839 0.246064 0.242748 0.001082 0.202449 0.213172 0.225494 0.203431 0.213914 0.211235 0.201302 0.209196 0.233867 0.204718 0.213790 0.211075
chargesum: 0.00000
title: Mulliken charges with hydrogens summed into heavy atoms:
elementType: P C C C C C C C C
charge: 0.341498 0.184037 0.165177 -0.248109 -0.247233 -0.047584 -0.058425 -0.033209 -0.056151
polarizability: 1.46185386e+02 -6.86050431e-02 1.00822211e+02 5.13233370e-01 -1.59744303e+00 9.36661524e+01
1716.lowfreq: -11.1712 -0.0016 -0.0014 0.0016 6.9820 15.5810 33.2557 37.7468 70.8631
frequency: 30.7860 37.4442 70.8100 96.5581 111.3496 194.1054 197.5846 205.2552 209.2410 240.8872 246.0869 312.3991 338.5197 387.3161 393.4456 417.9113 418.5052 674.4424 675.8551 725.6917 755.6808 807.3439 820.1420 892.2366 903.2502 917.0538 918.3705 954.8524 955.2181 957.7920 960.7893 1069.1768 1087.9352 1107.6246 1124.6079 1175.8388 1178.7840 1211.9922 1219.7890 1230.5001 1251.9649 1315.8877 1323.1997 1329.5846 1333.9787 1374.9179 1376.1365 1391.4711 1393.4915 1433.7042 1438.8385 1465.6787 1466.1004 1468.9196 1470.0337 1479.8627 1480.0559 1485.6337 1486.7786 2167.6679 2960.8185 2965.4251 2965.9214 2968.5894 2969.6305 2969.9700 2977.7251 2979.1974 3044.5601 3045.4173 3058.8382 3059.5783 3066.9359 3067.7392 3067.8381 3068.8162 3071.6666 3075.3995
redmass: 2.6946 3.3758 3.5659 2.5317 2.2384 2.5392 2.1497 1.0712 1.2751 1.1333 1.0965 2.9505 2.6690 2.3575 2.2569 2.2274 1.9594 3.0198 1.7898 1.3478 1.6118 2.9191 2.6492 1.3075 1.2185 1.1794 1.1838 1.4418 1.6684 1.6374 1.8433 1.2838 1.3810 2.0105 2.1850 1.8336 1.8361 1.5046 1.4373 1.2484 1.2303 1.4245 1.4148 1.4248 1.4172 1.2111 1.2135 1.2084 1.2075 1.0874 1.0880 1.0477 1.0452 1.0531 1.0527 1.0494 1.0556 1.0517 1.0461 1.0386 1.0817 1.0356 1.0359 1.0370 1.0375 1.0783 1.0576 1.0594 1.1045 1.1038 1.0996 1.0996 1.1001 1.0999 1.0988 1.0989 1.0989 1.0995
irintensity: 0.1307 0.0883 0.1005 1.1559 0.2823 0.2029 0.4072 0.0221 0.2012 0.0852 0.0438 0.1363 0.3165 0.5147 0.1675 2.1733 0.9090 1.5796 1.7995 0.0571 4.3249 5.2931 0.1209 17.7952 6.0129 6.5175 1.4046 1.6065 6.1867 1.6538 1.4662 6.5464 18.0657 4.9359 5.6453 31.4566 1.0987 3.0402 7.0024 2.1203 1.0178 0.4048 0.8753 3.0354 4.2366 20.3698 22.5463 27.8343 11.6757 3.8805 2.2630 1.6815 0.4453 7.6804 8.7705 12.8237 5.1634 18.8697 25.8442 72.1303 11.0610 35.3543 36.2377 30.7169 26.0388 10.4147 16.9158 47.4177 10.0613 11.1920 11.8071 6.0474 16.6103 34.6106 78.1880 101.9006 95.2572 51.8356
temp: 298.150 k
press: 1.00000 atm
elementType: 15 6 6 6 6 6 6 6 6 1 1 1 1 1 1 1 1 1 1 1 1 1 1 1 1 1 1 1
symmnumber: 1
zpe: 655261.4 jmol-1
zpe.correction: 0.249576 hartree
zpe.thermalcorrener: 0.262918 hartree
zpe.thermalcorrenthalpy: 0.263862 hartree
zpe.thermalcorrgfe: 0.209094 hartree
zpe.sumelectzpe: -656.695079 hartree
zpe.sumelectthermal: -656.681737 hartree
zpe.sumelectthermalent: -656.680793 hartree
zpe.sumelectthermalfe: -656.735561 hartree
dipole: -0.0139 1.1639 0.5078
dipole: 1.2699
quadrupole: -65.4072 -69.4616 -67.6294
quadrupole: 0.0682 0.5343 -1.4694
quadrupole: 2.0922 -1.9622 -0.1300 0.0682 0.5343 -1.4694
hfenergy: -656.9446552 hartree
pointgroup: C01 [X(C8H19P1)]
dipole: 0.0023312 0.4554157 0.2054415 debye
polarizability: 146.1736397|-0.3557268|100.8628207|-0.8729838|-1.5020903|93.6372884 unknown
InChI: InChI=1S/C8H19P/c1-7(2)5-9-6-8(3)4/h7-9H,5-6H2,1-4H3
charge 0 multiplicity 1
28 atoms
P  -0.020011 -0.714435 -0.208179
C  -2.869361 -0.094894 -0.231727
C  2.799455 -0.103935 0.238351
C  -1.468034 0.549558 -0.09072
C  1.436085 0.542172 -0.118037
C  -3.162145 -1.094842 0.912232
C  -3.959203 1.003613 -0.290439
C  3.259646 -1.116462 -0.83814
C  3.869729 0.99655 0.445114
H  -2.889637 -0.654059 -1.190658
H  2.680197 -0.648046 1.199724
H  -1.305243 1.269112 -0.917213
H  -1.395803 1.114252 0.859445
H  1.182772 1.326047 0.622104
H  1.503824 1.027479 -1.111781
H  0.025263 -1.074013 1.208461
H  -3.099578 -0.591187 1.89663
H  -4.178172 -1.519777 0.812735
H  -2.444864 -1.936463 0.912153
H  -3.979454 1.586994 0.650658
H  -4.961871 0.559131 -0.433541
H  -3.77624 1.708652 -1.12295
H  3.40979 -0.605583 -1.809272
H  4.217451 -1.588903 -0.551446
H  2.511445 -1.915223 -0.991245
H  4.011157 1.580533 -0.484816
H  4.845741 0.5531 0.717698
H  3.576962 1.699428 1.24746
