program: Gaussian 09
title: 000077615
version: EM64L-G09RevD.01
frameworkgroup: C1[X(C8H10S)]
method: RPBEPBE
basis: SDD
operation: Freq
keyword: #pfreq=noraman
keyword: PBEPBE/SDD
title: #p freq=noraman PBEPBE/SDD
converged: YES YES NO NO
title: Mulliken charges:
elementType: S C C C C C C C C H H H H H H H H H H
charge: -0.024203 0.541565 0.464292 -0.375324 -0.384638 -0.396310 -0.403033 -0.833878 -0.806110 0.251161 0.229221 0.231287 0.253336 0.228030 0.231223 0.226403 0.236356 0.223731 0.106893
chargesum: 0.00000
title: Mulliken charges with hydrogens summed into heavy atoms:
elementType: S C C C C C C C C
charge: 0.082690 0.541565 0.464292 -0.375324 -0.133478 -0.167090 -0.171746 -0.121289 -0.119620
polarizability: 1.38276507e+02 -2.29488941e+00 1.09875074e+02 -3.13701391e+00 -2.28186628e+00 5.28339462e+01
1716.lowfreq: -7.6356 0.0025 0.0026 0.0035 6.4718 11.8003 18.2681 127.2800 161.6251
frequency: 16.5807 127.2697 161.6033 172.0346 207.0537 242.7621 282.0107 311.3015 381.2815 436.4431 446.4556 462.1451 545.5188 675.6561 710.9891 728.0051 818.7079 857.9841 873.6163 895.9646 955.6150 982.0062 1006.2933 1041.9899 1047.3905 1048.8210 1154.6613 1216.6502 1230.4850 1280.0753 1361.0561 1388.0355 1397.4177 1400.9193 1461.7667 1467.6598 1472.6829 1478.8928 1490.3169 1572.4685 1616.8719 2432.0495 2962.3221 2975.6432 3037.5094 3057.0247 3085.3621 3087.9142 3117.5503 3133.2475 3142.6498
redmass: 1.0191 3.0283 1.2567 3.2468 1.9863 1.3947 2.6145 3.2569 5.2026 2.9025 3.0941 4.8624 3.3473 7.1069 3.0042 3.8677 1.2535 2.4211 1.5942 1.3404 1.3411 1.5013 1.3824 1.7712 1.8413 1.9119 1.2930 1.6791 6.6787 1.3761 4.8350 2.9807 1.2273 1.2950 1.0652 1.0934 1.0531 1.0886 3.0739 5.4162 6.8161 1.0382 1.0405 1.0385 1.0939 1.0952 1.0998 1.0981 1.0871 1.0919 1.0969
irintensity: 0.5706 3.2268 12.8080 0.7993 6.2836 14.3385 3.3004 0.5917 0.2198 8.2796 1.4572 0.8008 6.2920 4.4344 1.8090 3.0077 40.0019 8.3914 6.6482 2.5632 0.1019 11.7248 2.0786 4.6177 20.4342 12.6552 3.0985 0.8282 5.5113 0.6390 0.9818 6.0399 10.1915 10.6539 9.6150 15.9503 11.6932 30.4378 35.3532 10.1401 16.6205 21.8698 29.5906 35.6560 19.8904 23.0909 18.0351 18.6906 11.9212 12.6766 22.2299
temp: 298.150 k
press: 1.00000 atm
elementType: 16 6 6 6 6 6 6 6 6 1 1 1 1 1 1 1 1 1 1
symmnumber: 1
zpe: 397499.5 jmol-1
zpe.correction: 0.151400 hartree
zpe.thermalcorrener: 0.161188 hartree
zpe.thermalcorrenthalpy: 0.162133 hartree
zpe.thermalcorrgfe: 0.115353 hartree
zpe.sumelectzpe: -708.244520 hartree
zpe.sumelectthermal: -708.234732 hartree
zpe.sumelectthermalent: -708.233788 hartree
zpe.sumelectthermalfe: -708.280568 hartree
dipole: -0.5284 1.3133 -0.6001
dipole: 1.5376
quadrupole: -54.1190 -59.3856 -65.2152
quadrupole: 3.7687 -2.7186 0.3606
quadrupole: 5.4543 0.1877 -5.6420 3.7687 -2.7186 0.3606
hfenergy: -708.3959201 hartree
pointgroup: C01 [X(C8H10S1)]
dipole: -0.1146694 0.5467358 -0.2320873 debye
dipolederiv: -0.3096383 0.2348954 -0.1189839 0.1836062 -0.1300481 -0.1397276 -0.1413672 -0.114828 -0.0189726 0.108793 0.2309135 0.0130528 0.1918846 -0.2290125 -0.0071951 -0.0414491 0.0207952 -0.0109778 0.3725848 0.1008526 -0.0202146 0.069795 0.046817 -0.0105747 -0.0766559 -0.0309963 -0.0277949 0.4217996 -0.4625519 0.0328003 -0.4483273 0.3666191 0.0426776 -0.0490622 0.1040386 -0.1381051 -0.3221864 0.0676509 0.0040152 0.1615401 -0.0412519 0.0027487 0.0531131 -0.0396923 -0.1325051 -0.0054734 -0.0854417 -0.0056596 0.0493005 0.0975132 -0.0081066 0.0063232 0.0000994 -0.1608835 -0.1330673 -0.0607408 -0.0043221 -0.1505255 -0.0122153 0.01033 0.0015323 0.0087742 -0.178138 -0.1432969 -0.0384548 -0.0182347 0.0038365 0.0817722 0.0069608 -0.0131073 0.0317249 0.0645114 -0.1141839 -0.0567803 0.0135723 -0.0610329 0.0487207 0.0015023 0.1068132 0.0284389 0.0673603 0.0802272 -0.0420271 -0.0121814 -0.0558891 -0.0627801 -0.0121325 -0.0102251 -0.0075375 0.1449066 0.0484338 -0.0663067 -0.0010292 -0.0445953 -0.1221938 -0.0019956 0.0048433 -0.0056085 0.1505877 -0.0468727 0.114462 0.0011255 0.1053705 -0.0063587 -0.0058939 -0.0027214 0.0020149 0.1546618 -0.0131378 -0.0002063 -0.0569129 0.044428 0.0734514 0.0934569 -0.0888768 0.0448708 -0.0131312 -0.032846 -0.0119551 0.0730787 0.0355452 0.071562 -0.0918716 0.1190891 -0.0504358 -0.0643216 0.0931382 0.0420499 0.004503 -0.0764512 -0.1528291 -0.0252344 -0.0096252 -0.0242098 0.1127239 0.0461252 0.0026687 0.0053203 -0.0769858 -0.0761136 -0.1098699 -0.0571552 -0.1026497 0.0484894 -0.0231667 -0.03633 0.0505899 -0.0438901 0.0979976 0.033931 0.1068555 0.0430018 -0.1026361 -0.0329205 0.0496997 -0.0426048 0.1341097 -0.0350971 0.080668 -0.0837736 0.0519266 0.073216 0.0056883 0.017602 0.0820852 -0.021719 -0.016553 0.1403265 0.1754491 0.0402726 0.0310086 unknown
polarizability: 136.4498424|-7.162811|111.6154469|-4.5714078|-1.3138527|52.9202379 unknown
InChI: InChI=1S/C8H10S/c1-6-3-4-7(2)8(9)5-6/h3-5,9H,1-2H3
charge 0 multiplicity 1
19 atoms
S  1.994181 -2.076267 -0.003565
C  1.124331 0.658253 -0.031177
C  -1.649331 -0.133913 -0.015161
C  0.745954 -0.713481 -0.055374
C  -0.613354 -1.100271 -0.050041
C  0.07826 1.615027 -0.020394
C  -1.281198 1.234302 -0.009392
C  2.576153 1.093281 -0.016858
C  -3.106683 -0.560865 0.025924
H  -0.866677 -2.16605 -0.087454
H  0.341584 2.679681 -0.012181
H  -2.06092 2.005182 0.003407
H  3.129423 0.609895 0.810294
H  3.099948 0.820985 -0.955541
H  2.659708 2.186852 0.099188
H  -3.270676 -1.498584 -0.53387
H  -3.440087 -0.737757 1.067064
H  -3.766289 0.213578 -0.403293
H  2.917775 -1.509348 -0.867273
