program: Gaussian 09
title: 000086415
version: EM64L-G09RevD.01
frameworkgroup: C1[X(C19H26N4O)]
method: RPBEPBE
basis: SDD
operation: Freq
keyword: #p
keyword: freq=noraman
keyword: PBEPBE/SDD
title: #p freq=noraman PBEPBE/SDD
converged: YES YES NO NO
title: Mulliken charges:
elementType: O N N N N C C C C C C C C C C C C C C C C C C C H H H H H H H H H H H H H H H H H H H H H H H H H H
charge: -0.278837 -0.299998 -0.376534 -0.425120 -0.427482 -0.354386 -0.545950 -0.490564 0.467249 -0.540381 0.259597 0.544776 -0.596408 -0.431537 0.460829 -0.523313 -0.505143 0.464439 -0.195256 -0.438178 -0.190998 -0.437247 -0.636522 -0.636282 0.253278 0.180589 0.197087 0.255614 0.227411 0.190343 0.247190 0.261291 0.223959 0.296038 0.237297 0.269841 0.255485 0.231511 0.215787 0.211058 0.218686 0.214221 0.293336 0.294860 0.226358 0.219773 0.228738 0.219984 0.235347 0.228160
chargesum: 0.00000
title: Mulliken charges with hydrogens summed into heavy atoms:
elementType: O N N N N C C C C C C C C C C C C C C C C C C C
charge: -0.278837 -0.052808 -0.080496 -0.131784 -0.132622 0.079480 -0.093249 -0.072810 0.467249 -0.055130 0.259597 0.544776 -0.359110 -0.161696 0.460829 -0.267828 -0.273631 0.464439 0.020531 -0.227119 0.027688 -0.223026 0.038347 0.047210
polarizability: 3.12237453e+02 1.94038774e+01 2.60049580e+02 1.19840692e+01 1.73530334e+01 1.61024868e+02
1716.lowfreq: -10.5153 -3.2072 -0.0011 -0.0008 0.0003 2.4493 7.1384 9.9215 14.7791
frequency: -7.4645 9.5834 14.4989 22.3990 35.8861 40.7719 66.3845 90.1878 97.1905 103.7168 123.2530 128.2258 148.1559 162.0557 167.1272 175.5763 195.3100 214.3538 225.2869 239.3361 239.9158 260.9234 296.4110 309.7764 332.4133 343.2086 359.0825 410.1676 429.0992 443.9137 447.5451 460.8302 474.4456 539.2916 550.7596 559.0600 562.8478 578.8809 612.7183 623.3300 635.2256 676.8261 696.6341 699.8632 704.2403 736.2565 743.8185 785.9270 788.8395 801.1107 857.9242 862.6760 867.6159 879.5324 881.6398 911.8814 943.0794 961.2007 966.8631 977.2524 979.5758 980.3602 1002.8360 1017.8613 1042.0160 1065.2310 1073.6961 1076.1471 1088.3020 1092.9725 1105.3723 1124.4737 1124.6889 1142.2163 1156.4623 1157.2306 1159.4856 1172.7111 1179.2119 1195.2277 1196.2351 1215.5667 1227.1408 1231.0675 1268.5800 1293.1468 1299.1515 1303.9962 1308.8532 1313.2625 1339.0080 1354.1604 1383.2742 1392.0773 1397.8033 1429.1793 1430.4041 1446.8144 1448.6578 1449.0710 1450.0445 1464.8589 1465.6498 1469.3272 1476.1736 1478.6195 1482.2427 1484.5164 1494.7171 1501.9750 1502.4825 1515.3425 1518.0851 1597.2292 1597.4439 1612.4922 1627.3033 1628.8972 2851.6767 2862.9245 2936.9745 2942.9547 2972.2726 2973.7022 2987.5091 2996.1677 3004.5560 3029.9191 3048.3698 3049.1012 3088.0317 3091.6111 3107.2010 3110.1513 3125.9438 3130.9291 3134.6691 3144.8369 3151.2804 3165.3917 3430.8872 3548.9904 3593.5509 3595.4343
redmass: 3.7467 5.0048 4.3559 4.4649 4.4956 6.4669 3.5458 2.9074 2.9422 3.1920 3.6664 2.5908 3.0591 1.2945 1.2344 3.8902 2.9211 3.2959 3.2247 2.5577 2.4969 4.0604 3.4341 3.7231 1.1722 1.1682 3.1997 3.6466 3.1858 3.4720 3.5778 3.6143 2.9203 4.0134 4.0583 4.1385 3.6342 2.1429 1.5922 5.1366 4.2393 1.7017 2.7933 1.8921 1.9534 3.9310 3.8579 1.6356 1.5216 1.2879 1.5120 1.4649 1.6185 1.6800 2.1957 2.8283 3.0506 1.3305 1.3554 2.7056 5.6365 2.8758 2.8932 2.2288 3.3018 2.1442 2.2618 2.5495 1.6339 1.6661 2.6382 1.2788 1.2776 3.2146 1.7151 1.7632 1.2490 1.1168 1.0929 1.9086 1.9998 1.5952 1.2841 1.2430 1.2481 1.2829 1.4218 1.6466 1.8079 1.4912 1.4690 1.4946 1.6680 4.0519 4.9464 1.8306 1.8946 1.1005 1.4111 1.4192 1.2622 1.0417 1.0414 1.2467 1.3497 1.5035 1.8302 1.7902 1.0842 1.1610 1.1863 2.0032 2.1246 5.3548 5.3973 6.2023 6.2385 6.2191 1.0717 1.0716 1.0378 1.0377 1.0857 1.0608 1.0613 1.1008 1.1010 1.0917 1.0998 1.0950 1.0953 1.0958 1.0869 1.0867 1.0903 1.0904 1.0928 1.0914 1.0982 1.0956 1.0744 1.0777 1.0775 1.0774
irintensity: 0.2074 0.3941 0.0472 2.2448 2.8141 3.2587 2.5914 2.8229 3.5979 6.1733 6.2369 7.2995 1.1405 0.9832 1.4433 2.5939 13.8804 5.9958 10.8763 0.0930 2.2911 2.5657 7.2979 3.0609 89.0700 99.0708 11.0537 0.8095 0.4537 2.7974 1.5526 4.3817 24.1656 1.9201 9.6555 1.8446 4.4016 37.4727 57.1764 0.8557 6.5410 63.4166 16.7354 22.2861 40.4457 11.4437 20.1766 44.9022 72.7086 5.9201 25.6529 5.2321 15.3128 8.3296 4.1363 9.1391 1.4137 0.9365 8.5442 5.4451 10.1163 30.2992 9.7729 3.8973 7.7320 1.4178 6.0269 1.0369 9.5975 24.0892 1.7560 1.7405 2.0346 88.8565 1.0421 13.0422 0.5383 4.7022 8.6609 14.2137 14.0696 39.5648 2.1225 127.1345 18.1364 3.5309 5.7319 3.6841 41.6251 15.6196 37.7823 15.3423 16.6482 33.2432 30.1098 34.6241 19.3510 26.1389 4.0406 2.3295 29.4642 11.3054 12.2583 82.0069 38.3709 10.2025 32.0947 197.4570 4.0775 10.4724 4.5780 146.9294 147.5999 39.3985 35.9410 152.6058 191.5923 242.6072 50.0888 151.8931 96.5073 79.7521 23.7724 25.0800 44.4381 58.5056 52.6007 3.4591 18.2736 23.8727 30.8943 28.1676 17.0941 10.0717 22.7067 29.8192 19.8448 24.1426 17.7953 8.0107 0.8035 16.5831 34.2213 34.5360
temp: 298.150 k
press: 1.00000 atm
elementType: 8 7 7 7 7 6 6 6 6 6 6 6 6 6 6 6 6 6 6 6 6 6 6 6 1 1 1 1 1 1 1 1 1 1 1 1 1 1 1 1 1 1 1 1 1 1 1 1 1 1
symmnumber: 1
zpe: 1104023.4 jmol-1
zpe.correction: 0.420500 hartree
zpe.thermalcorrener: 0.444907 hartree
zpe.thermalcorrenthalpy: 0.445851 hartree
zpe.thermalcorrgfe: 0.362452 hartree
zpe.sumelectzpe: -1032.063094 hartree
zpe.sumelectthermal: -1032.038687 hartree
zpe.sumelectthermalent: -1032.037743 hartree
zpe.sumelectthermalfe: -1032.121142 hartree
dipole: 0.7286 4.8459 -3.4256
dipole: 5.9790
quadrupole: -111.6354 -124.0156 -153.0210
quadrupole: 3.7903 4.4613 9.2068
quadrupole: 17.9219 5.5417 -23.4637 3.7903 4.4613 9.2068
hfenergy: -1032.4835938 hartree
pointgroup: C01 [X(C19H26N4O1)]
dipole: 0.1481899 -2.1963387 0.8291458 debye
polarizability: 309.6752765|-19.7704446|247.8894537|-14.7620656|40.2301337|175.7471716 unknown
InChI: InChI=1S/C19H26N4O/c1-20-17-7-3-5-15(11-17)13-22-10-9-19(24)23-14-16-6-4-8-18(12-16)21-2/h3-8,11-12,20-23H,9-10,13-14H2,1-2H3
charge 0 multiplicity 1
50 atoms
O  -1.673269 2.215763 -1.452555
N  2.030037 0.673677 0.106274
N  -2.691064 1.885935 0.615667
N  7.499931 -2.102475 -0.02617
N  -5.585474 -2.451254 -0.655144
C  0.684687 0.787076 -0.489329
C  -0.250416 1.573521 0.44944
C  3.052094 0.071535 -0.777692
C  4.436011 0.068338 -0.133967
C  -4.048421 2.241769 0.159628
C  -1.58677 1.910134 -0.221811
C  -5.062433 1.121077 0.367327
C  5.308288 -1.022888 -0.359181
C  4.860896 1.161183 0.6606
C  6.623269 -1.03561 0.191402
C  -4.83965 -0.14328 -0.228942
C  -6.228695 1.347695 1.135349
C  -5.780958 -1.199445 -0.069506
C  6.162094 1.149602 1.215914
C  7.039819 0.073392 0.988886
C  -7.168716 0.300045 1.29925
C  -6.95563 -0.957676 0.710497
C  7.169018 -3.277027 -0.824898
C  -4.436312 -2.785989 -1.490783
H  0.76126 1.344259 -1.440682
H  0.222419 -0.202052 -0.736035
H  -0.411159 1.021367 1.397579
H  0.259548 2.522121 0.708382
H  3.075406 0.680486 -1.705569
H  2.7961 -0.969883 -1.098528
H  2.015707 0.211907 1.026594
H  -3.938209 2.488085 -0.913056
H  -4.389619 3.156158 0.682602
H  -2.574778 1.582397 1.58411
H  4.961814 -1.866363 -0.967422
H  4.172119 1.9933 0.832504
H  -3.934104 -0.294107 -0.82626
H  -6.403278 2.326908 1.596067
H  6.498407 1.992672 1.831277
H  8.047231 0.079324 1.425583
H  -8.074851 0.467987 1.892859
H  -7.691359 -1.761312 0.844727
H  8.423049 -2.048528 0.398556
H  -6.309891 -3.153734 -0.522948
H  6.305605 -3.835368 -0.406575
H  8.034633 -3.960036 -0.844783
H  6.922525 -3.010607 -1.873767
H  -4.528465 -3.82927 -1.835521
H  -4.369013 -2.134912 -2.386556
H  -3.480732 -2.694892 -0.934793
