program: Gaussian 09
title: 000077612
version: EM64L-G09RevD.01
frameworkgroup: C1[X(C6H6N2O4)]
method: RPBEPBE
basis: SDD
operation: Freq
keyword: #pfreq=noraman
keyword: PBEPBE/SDD
title: #p freq=noraman PBEPBE/SDD
converged: YES YES NO NO
title: Mulliken charges:
elementType: O O O O N N C C C C C C H H H H H H
charge: -0.233098 -0.235409 -0.464589 -0.206023 -0.406066 -0.389530 0.196418 0.168557 0.128466 -0.760167 0.136412 0.141871 0.389408 0.269270 0.245811 0.245753 0.368552 0.404366
chargesum: 0.00000
title: Mulliken charges with hydrogens summed into heavy atoms:
elementType: O O O O N N C C C C C C
charge: -0.233098 -0.235409 -0.060223 -0.206023 -0.016657 -0.020978 0.196418 0.168557 0.128466 0.000666 0.136412 0.141871
polarizability: 1.15901457e+02 3.74740847e+00 1.24652455e+02 -3.61473151e-03 8.79776216e-03 4.21533246e+01
1716.lowfreq: -7.5133 -3.4721 0.0003 0.0007 0.0010 4.6664 64.3505 97.2946 134.3177
frequency: 64.3180 97.2912 134.3150 137.6572 166.3222 190.1624 305.7656 323.5756 345.3634 388.6247 413.1587 460.7371 461.3354 536.8344 598.9642 622.1418 640.0201 679.0948 704.8580 742.6362 757.7025 760.8423 789.5504 887.5078 975.7814 995.4726 1036.1978 1090.8517 1164.6997 1216.1561 1229.8521 1311.3857 1360.1435 1379.0327 1402.2295 1441.1220 1469.1456 1470.8038 1600.0340 1622.3097 1660.3983 1685.0707 2996.4904 3073.3232 3115.5558 3527.3374 3535.5862 3552.9741
redmass: 8.0896 4.8106 2.2973 1.5569 6.6868 7.7039 4.1373 4.2955 6.6998 8.0868 10.1264 7.4072 3.6275 7.8069 1.3032 4.9276 5.0298 2.2271 2.2256 2.3350 3.7600 5.1851 2.0110 5.0453 3.4803 2.3766 1.4637 1.7644 4.0324 5.1235 3.6424 3.2355 1.8943 2.1655 1.1930 1.3962 1.0457 1.9529 7.5712 7.7893 9.1061 5.8320 1.0369 1.0962 1.1005 1.0770 1.0779 1.0651
irintensity: 0.7952 0.8994 0.0401 1.5492 4.4640 1.5081 1.8969 5.0975 4.6835 26.5762 6.6022 16.5453 10.6554 1.3841 170.0731 34.4505 1.4259 24.5377 5.3030 8.6440 45.4176 15.9617 187.3442 13.4075 7.1377 195.1769 3.7973 246.0961 31.0024 16.9684 3.2219 193.6925 29.7343 22.6610 39.0244 54.9489 16.7280 41.1280 149.5914 174.2437 242.0281 654.3871 6.4341 7.5418 4.7368 70.8128 122.5388 86.1639
temp: 298.150 k
press: 1.00000 atm
elementType: 8 8 8 8 7 7 6 6 6 6 6 6 1 1 1 1 1 1
symmnumber: 1
zpe: 329695.2 jmol-1
zpe.correction: 0.125574 hartree
zpe.thermalcorrener: 0.136321 hartree
zpe.thermalcorrenthalpy: 0.137265 hartree
zpe.thermalcorrgfe: 0.088882 hartree
zpe.sumelectzpe: -641.809615 hartree
zpe.sumelectthermal: -641.798868 hartree
zpe.sumelectthermalent: -641.797924 hartree
zpe.sumelectthermalfe: -641.846307 hartree
dipole: -3.6925 -1.1973 -0.0017
dipole: 3.8818
quadrupole: -68.9744 -79.5609 -67.9319
quadrupole: 8.0889 0.0083 -0.0019
quadrupole: 3.1813 -7.4052 4.2238 8.0889 0.0083 -0.0019
hfenergy: -641.9351894 hartree
pointgroup: C01 [X(C6H6N2O4)]
dipole: 1.437777 0.5148385 -0.0099731 debye
dipolederiv: -0.7616362 -0.4326286 0.0077228 -0.2032411 -0.9806829 0.0111663 0.0036477 0.0111484 -0.3542259 -0.7871964 0.4690616 -0.0083049 0.4857826 -1.1479492 0.0134812 -0.0085602 0.0134395 -0.386199 -0.5065957 -0.3779428 0.0071682 -0.4284187 -1.2501501 0.0153145 0.0082036 0.0152868 -0.4427323 -0.9577305 0.1293776 -0.0027989 0.1670405 -0.6035552 0.0062582 -0.0033334 0.0062877 -0.2858216 -0.9197819 0.7964997 -0.0141786 -0.0776852 -0.8790337 0.0103833 0.0015837 0.0104017 -0.292875 -0.3966766 0.1082099 -0.0019111 0.1568393 -1.2293359 0.0157 -0.0028211 0.0157244 -0.3439199 -0.428214 -0.5462977 0.0097523 0.0417866 0.0825568 -0.0020559 -0.0006735 -0.0023671 -0.029105 -0.3715259 -0.6681278 0.0119548 -0.202021 0.6444282 -0.0101498 0.003348 -0.0101983 0.0620211 1.2045944 0.4153849 -0.0074724 0.0320372 1.3515849 -0.0195709 -0.0005797 -0.0195291 0.2576395 -0.0107408 0.2801131 -0.0049627 0.0191913 -0.1089675 0.0025586 -0.0002018 0.0032798 0.0284498 1.4313971 -0.6899967 0.0121881 -0.4341469 1.6683346 -0.0236511 0.0075876 -0.023636 0.3298843 1.6312962 0.4971117 -0.0086455 0.2747891 1.5341138 -0.024657 -0.0047279 -0.0245403 0.2513605 0.2961641 0.0657639 -0.0011441 0.0648138 0.2890352 0.0009434 -0.0012164 0.0009802 0.3431399 0.078249 -0.1550816 0.0023999 -0.034708 0.0352102 0.0012417 0.0003534 0.001058 0.1197473 0.0380085 0.009854 -0.0912332 -0.0034743 0.0468133 -0.0175658 -0.0838747 0.0177174 -0.0089148 0.0373283 0.0128315 0.0911191 -0.00085 0.04685 0.0159057 0.0840336 -0.019699 -0.0081631 0.2399434 0.0042019 -0.0000549 0.0084635 0.1430135 0.0035477 -0.0001238 0.003557 0.3427536 0.1831169 0.0816654 -0.0015989 0.1338013 0.3577341 0.0011498 -0.0026452 0.0010888 0.4169605 unknown
polarizability: 115.6821121|3.4744137|124.8449958|-0.0625641|-1.4888304|42.1801292 unknown
InChI: InChI=1S/C6H6N2O4/c1-2-3(5(10)11)7-6(12)8-4(2)9/h7-8,10H,1H3
charge 0 multiplicity 1
18 atoms
O  -2.09152 -2.227751 0.082495
O  -2.138773 2.448213 -0.000589
O  2.474479 1.695698 0.01084
O  3.022483 -0.569186 0.054283
N  -0.080284 1.327853 0.019044
N  -2.069358 0.098636 0.041041
C  0.071857 -1.10704 0.062245
C  0.670913 0.144128 0.039989
C  -1.415302 -1.159751 0.063403
C  0.799961 -2.426077 0.085567
C  -1.480546 1.377077 0.01833
C  2.150352 0.325055 0.036871
H  0.419294 2.221426 0.003006
H  0.058284 -3.240023 0.097754
H  1.455192 -2.514151 0.970186
H  1.458808 -2.543406 -0.792914
H  -3.094293 0.080173 0.041496
H  3.460853 1.812127 0.008851
