program: Gaussian 09
title: 000077614
version: EM64L-G09RevD.01
frameworkgroup: C1[X(C7H15NO)]
method: RPBEPBE
basis: SDD
operation: Freq
keyword: #p
keyword: freq=noraman
keyword: PBEPBE/SDD
title: #p freq=noraman PBEPBE/SDD
converged: NO YES NO NO
title: Mulliken charges:
elementType: O N C C C C C C C H H H H H H H H H H H H H H H
charge: -0.494272 -0.636268 0.418461 -0.476552 -0.479362 -0.395105 -0.380202 -0.388015 -0.526119 0.208955 0.184198 0.182622 0.193656 0.225973 0.185453 0.185476 0.220197 0.180672 0.200874 0.209250 0.233328 0.362720 0.287437 0.296623
chargesum: 0.00000
title: Mulliken charges with hydrogens summed into heavy atoms:
elementType: O N C C C C C C C
charge: -0.131552 -0.052208 0.418461 -0.083399 -0.103084 0.016321 0.025471 -0.006469 -0.083541
polarizability: 9.54758501e+01 6.45026455e-01 7.96695699e+01 -1.86467156e-01 5.15121090e-01 7.38127785e+01
1716.lowfreq: -38.0322 -17.5253 -4.5081 0.0002 0.0004 0.0005 95.3192 124.8966 188.5513
frequency: 95.1047 124.8883 188.5355 224.6521 269.4686 288.4139 323.9637 350.4638 405.5728 412.3889 469.8738 496.0409 602.7630 688.7705 717.3652 756.4484 772.8875 828.5351 844.1931 865.7947 911.7986 924.6552 934.6611 969.6170 1029.2272 1041.3347 1056.3678 1080.5411 1090.6667 1121.5595 1145.3466 1161.5239 1230.6360 1246.7071 1254.6476 1272.0706 1294.7073 1319.1584 1326.7767 1336.7703 1340.7729 1347.3959 1357.0804 1401.9878 1441.2490 1452.0576 1457.4247 1458.9037 1466.0186 1473.1023 1641.1109 2946.7931 2951.5630 2955.6345 2962.7705 2983.5674 2985.5096 3012.2352 3025.2953 3032.3594 3044.5062 3045.0629 3054.0315 3247.4273 3473.6316 3595.0615
redmass: 2.8513 2.8254 2.3639 2.3902 1.1225 2.4247 2.6157 2.6586 1.9912 2.6089 3.2027 1.9833 2.3354 1.4244 2.0691 1.2179 1.5255 2.6991 1.7196 1.9015 2.1783 1.4625 2.1821 1.7929 3.1758 1.4418 1.8310 1.9099 1.6310 1.2768 1.6133 2.5990 1.6278 1.3319 1.2807 1.2970 1.3473 1.3958 1.3464 1.3953 1.4403 1.4221 1.3796 1.6513 1.0897 1.1045 1.0869 1.0858 1.0839 1.0949 1.0906 1.0632 1.0616 1.0636 1.0623 1.0630 1.0627 1.0988 1.0956 1.0971 1.1029 1.0976 1.1025 1.0633 1.0459 1.0975
irintensity: 5.3688 1.3116 4.5430 2.4827 13.3260 1.1341 2.6154 2.8255 2.1352 0.7814 2.6238 5.9501 18.0259 88.1739 31.3828 184.4014 3.4719 7.6811 5.4214 14.9072 11.6059 2.0287 6.2574 32.9080 12.7459 8.0889 11.2698 8.3320 9.4284 14.7961 3.0426 9.1174 10.3994 4.0582 11.6557 6.3343 15.4298 7.5548 6.8982 0.2546 0.3908 2.3409 5.0460 63.4082 2.1689 0.5163 11.8538 12.6079 16.9610 6.7162 53.8106 20.4117 29.2864 39.6918 84.6279 37.9130 42.7473 67.7509 71.9835 20.4199 19.0948 28.5060 100.2248 123.3710 0.4980 5.1056
temp: 298.150 k
press: 1.00000 atm
elementType: 8 7 6 6 6 6 6 6 6 1 1 1 1 1 1 1 1 1 1 1 1 1 1 1
symmnumber: 1
zpe: 565997.8 jmol-1
zpe.correction: 0.215577 hartree
zpe.thermalcorrener: 0.224993 hartree
zpe.thermalcorrenthalpy: 0.225938 hartree
zpe.thermalcorrgfe: 0.182013 hartree
zpe.sumelectzpe: -404.965268 hartree
zpe.sumelectthermal: -404.955852 hartree
zpe.sumelectthermalent: -404.954908 hartree
zpe.sumelectthermalfe: -404.998833 hartree
dipole: 2.4151 0.6247 -2.3894
dipole: 3.4543
quadrupole: -46.9103 -55.6664 -60.2813
quadrupole: 1.2250 -1.4963 0.7734
quadrupole: 7.3757 -1.3804 -5.9953 1.2250 -1.4963 0.7734
hfenergy: -405.1808456 hartree
pointgroup: C01 [X(C7H15N1O1)]
dipole: 1.0112308 -0.2080808 0.8837782 debye
dipolederiv: -0.6102651 -0.0863037 0.0181509 -0.0996651 -0.5294201 0.0295233 0.1440578 0.012336 -0.7637712 -0.6907483 0.1127651 -0.0228397 0.1570742 -0.2725563 -0.1387109 -0.0199911 -0.0966711 -0.6360739 0.2995127 0.0662661 -0.0972756 0.0399017 0.3593085 -0.0359294 -0.2508801 -0.0496267 0.4330664 -0.0462718 0.024095 0.0157193 0.0152791 0.0235669 -0.0361612 -0.0302204 0.0327719 0.1466912 -0.0485381 -0.0548815 -0.0144504 -0.0671904 -0.0612284 0.0564916 -0.0151865 -0.0172434 0.0980694 0.0770993 -0.0260866 -0.027395 -0.0056573 0.0704068 0.0165519 0.0125882 0.0036756 0.102321 0.0602434 0.0210677 -0.0196914 0.0013351 0.0833961 -0.0313361 0.0269734 0.0096885 0.0962087 0.0622346 0.0058381 0.0155952 0.0090764 0.0278478 0.0039123 -0.0135744 -0.0022198 0.1782935 0.3588935 -0.1305066 -0.1720384 -0.1495206 0.1727772 0.0578425 -0.015621 0.0041831 0.2528862 -0.0020997 -0.1045617 0.0255346 -0.0802513 -0.1542591 0.0421362 0.0244729 0.0795155 0.0597696 0.0351157 0.0072352 -0.0141452 0.0156193 0.0748105 0.0161693 -0.0176542 -0.0461685 -0.1938241 0.0405922 -0.0266904 0.0037236 -0.0286792 0.0537742 -0.0120013 -0.0226491 0.0307286 -0.2075993 -0.098165 0.1473752 0.036837 0.1389149 -0.0800196 -0.0258484 0.0507583 -0.057515 0.0525385 0.0748927 -0.0325765 0.0043104 -0.0361761 0.0581911 -0.0064821 -0.0386472 0.0359655 -0.1370594 -0.1000331 0.1304508 0.0369631 0.1345842 -0.1220526 -0.0429475 0.060137 -0.0704748 0.0607863 -0.0122251 -0.0792918 0.0144961 -0.0894886 -0.2091736 0.0525132 0.0259244 0.0831527 0.0623274 0.0545432 0.0283647 0.0071835 0.0383996 0.0838807 0.0063382 -0.0242279 -0.0546452 -0.1369031 0.0733216 0.0114942 -0.0099368 0.0113921 0.0173756 -0.0019364 0.0702379 0.0129113 -0.216162 -0.2243677 -0.0521344 -0.0628921 -0.0527727 0.0303521 -0.0127298 -0.1011722 -0.0200668 0.050641 0.015059 0.0359546 0.0349425 0.0366719 0.0535742 0.047557 0.0221481 -0.0076623 -0.2317743 0.0244608 -0.0471972 0.0244471 -0.0650507 -0.1478621 -0.005929 0.0481424 0.0388898 0.0658852 0.4049593 0.0408638 0.1075427 0.056961 0.2520826 -0.0258178 0.0701292 -0.0054548 0.3282947 0.2186452 0.0360718 0.0541849 0.0546438 0.0703827 0.0571697 0.0376206 0.1107091 0.2233747 0.0331408 -0.0276122 0.0410337 -0.0354012 0.1448449 -0.0103751 -0.0433663 -0.0267792 0.3120136 unknown
polarizability: 95.4469539|-0.0871197|79.6504345|-1.0974028|0.4905047|73.8608101 unknown
InChI: InChI=1S/C7H15NO/c8-6-7(9)4-2-1-3-5-7/h9H,1-6,8H2
charge 0 multiplicity 1
24 atoms
O  0.622917 0.254084 -1.506704
N  2.935129 -0.274429 -0.253978
C  0.512029 0.22157 -0.036554
C  -0.484596 1.323032 0.379646
C  0.006795 -1.177036 0.417669
C  -1.917407 1.029328 -0.125142
C  -1.416096 -1.464821 -0.11303
C  -2.405967 -0.364258 0.335678
C  1.939411 0.510464 0.522866
H  -0.128525 2.289012 -0.026814
H  -0.486341 1.403731 1.487544
H  0.003789 -1.219357 1.527889
H  0.707751 -1.957065 0.056883
H  -1.910835 1.064613 -1.231207
H  -2.609155 1.818784 0.228547
H  -1.757742 -2.460025 0.232795
H  -1.377689 -1.489616 -1.219232
H  -2.496409 -0.378078 1.442957
H  -3.415221 -0.567344 -0.072281
H  1.973175 0.310954 1.615195
H  2.162341 1.581762 0.365221
H  1.560001 -0.089766 -1.660535
H  3.061749 -1.238265 0.069887
H  3.832498 0.196427 -0.3953
