program: Gaussian 09
title: 000077600
version: EM64L-G09RevD.01
frameworkgroup: C1[X(C6H9N3O)]
method: RPBEPBE
basis: SDD
operation: Freq
keyword: #pfreq=noraman
keyword: PBEPBE/SDD
title: #p freq=noraman PBEPBE/SDD
converged: YES YES NO NO
title: Mulliken charges:
elementType: O N N N C C C C C C H H H H H H H H H
charge: -0.248319 -0.427606 -0.041339 -0.631000 0.297545 0.081858 -0.785724 -0.014458 -0.770948 0.144996 0.304507 0.239416 0.238186 0.254415 0.252667 0.189919 0.253874 0.354739 0.307274
chargesum: 0.00000
title: Mulliken charges with hydrogens summed into heavy atoms:
elementType: O N N N C C C C C C
charge: -0.248319 -0.123100 -0.041339 0.031013 0.297545 0.081858 -0.053707 -0.014458 -0.074488 0.144996
polarizability: 1.13887213e+02 -1.20871322e+01 1.08690079e+02 4.03569655e-02 5.88462799e-03 4.70827104e+01
1716.lowfreq: -12.3570 -3.3139 -0.0004 -0.0004 0.0005 5.8120 31.6119 45.6433 76.1524
frequency: 31.4832 45.2686 76.1519 165.1706 174.5902 201.2535 292.2678 316.5684 326.3995 350.4365 455.6611 503.3303 507.6679 541.6610 550.4624 573.0653 608.5355 693.0945 744.1712 755.4316 886.9065 932.5425 1018.1371 1033.1892 1044.7471 1051.9806 1131.6599 1168.3216 1217.2528 1311.0459 1376.5546 1398.7826 1410.2257 1446.4965 1457.2709 1462.2810 1472.3953 1475.8365 1562.0346 1590.6274 1634.7213 1669.2558 2973.5626 2991.2471 3042.9793 3066.1984 3102.2411 3134.1970 3537.2084 3554.1261 3706.7855
redmass: 1.0313 1.0796 2.8410 2.6397 4.6426 1.3959 2.7646 3.8838 2.9044 3.8281 5.8009 1.1279 6.7699 3.7980 1.2207 3.6150 6.3996 8.6782 5.2181 7.1190 2.2544 2.3523 2.0872 1.4247 1.6077 1.5408 3.1432 4.2838 4.7983 2.0529 2.3435 1.5976 1.2210 1.0433 2.8032 1.0948 1.0435 1.3005 7.0262 1.5198 2.4146 6.3784 1.0412 1.0369 1.0979 1.0966 1.0995 1.0930 1.0769 1.0460 1.1052
irintensity: 0.7663 1.1123 7.3867 3.3979 2.3646 65.8085 5.3291 1.3328 2.6358 2.2312 3.4686 344.6136 2.8837 2.3500 26.0703 0.7882 0.1593 4.7648 2.3102 13.4529 7.0538 2.1774 15.8085 5.7698 14.4526 0.0538 6.1020 13.3101 15.1681 68.7788 16.9979 39.9092 19.0977 6.7630 193.4347 10.0268 17.1875 33.6650 533.2254 5.6606 382.5558 176.7124 33.8624 23.8654 19.1369 13.4064 25.3117 12.0430 20.0578 85.7068 40.3978
temp: 298.150 k
press: 1.00000 atm
elementType: 8 7 7 7 6 6 6 6 6 6 1 1 1 1 1 1 1 1 1
symmnumber: 1
zpe: 393412.8 jmol-1
zpe.correction: 0.149843 hartree
zpe.thermalcorrener: 0.160614 hartree
zpe.thermalcorrenthalpy: 0.161558 hartree
zpe.thermalcorrgfe: 0.112570 hartree
zpe.sumelectzpe: -472.782640 hartree
zpe.sumelectthermal: -472.771869 hartree
zpe.sumelectthermalent: -472.770925 hartree
zpe.sumelectthermalfe: -472.819913 hartree
dipole: -3.1360 8.5796 0.0105
dipole: 9.1348
quadrupole: -42.9907 -66.0930 -61.0924
quadrupole: -1.1619 -0.0185 0.0145
quadrupole: 13.7347 -9.3676 -4.3670 -1.1619 -0.0185 0.0145
hfenergy: -472.9324834 hartree
pointgroup: C01 [X(C6H9N3O1)]
dipole: 1.2206954 -3.379792 0.0556613 debye
dipolederiv: -0.6931262 0.2834982 -0.0053065 0.3442441 -1.1263336 0.011909 -0.0062825 0.0109881 -0.3838671 -1.016065 0.1068574 -0.0057557 -0.4113242 -0.7406022 0.0044324 0.000708 0.0079635 -0.2423973 -1.2925725 0.4035796 -0.0108135 0.5014242 -0.763379 0.0085129 -0.0125226 0.0081034 -0.3167574 -1.5675791 0.110867 -0.0048382 0.0945303 -0.2289683 -0.0078818 -0.0028405 -0.0081456 -0.7654922 0.6975657 -0.3053366 0.0082977 0.0419552 0.5400828 -0.008638 0.0042882 -0.0127025 -0.0375178 0.0665186 -0.2288427 0.0026724 -0.055365 -0.6908433 0.0083847 -0.0015935 0.0075399 -0.0443383 -0.0602562 -0.0114814 -0.0018843 -0.1168805 -0.1039697 0.0027716 -0.0000223 0.0066118 0.1065461 1.2411998 -0.2930464 0.0091998 -0.3873694 1.4338352 -0.0182865 0.0105703 -0.0173717 0.1951586 -0.1223072 0.0570929 -0.0011729 0.0952266 0.0652735 0.0017202 0.0010213 0.0012349 0.0476423 1.9833409 -0.1780333 0.011943 -0.1528002 1.1272688 -0.0119545 0.0118144 -0.011521 0.2445257 0.1453038 0.0131206 -0.0012586 0.0171265 0.1140941 0.0027569 -0.0009674 0.0021192 0.3241691 0.0803481 0.0427932 -0.0787652 0.0040387 -0.0273396 0.0738108 -0.053568 0.1262637 -0.0464179 0.0754694 0.0510238 0.0821569 0.0084532 -0.0335987 -0.0747625 0.0572199 -0.1265242 -0.0356045 -0.090577 -0.0433586 -0.0028787 0.0469993 0.1259642 0.0009824 -0.0039137 -0.0009308 0.1135928 0.0390523 0.0212946 0.0301432 0.0467071 0.0571456 -0.0923617 0.0716218 -0.0770538 -0.0273301 -0.0123316 -0.0774916 -0.0008723 -0.1795386 -0.0984616 -0.0025974 -0.0007276 -0.00081 0.0963668 0.0447921 0.0185689 -0.0281223 0.0465646 0.0573721 0.0933638 -0.0698291 0.0762452 -0.026006 0.2633219 0.0328101 -0.0015395 0.0617536 0.1786393 0.0033484 -0.0023639 0.0030748 0.3977406 0.2179023 -0.0039156 -0.0012054 -0.0057456 0.1138204 0.0044892 -0.0026129 0.004915 0.3999867 unknown
polarizability: 113.7920386|-12.1012|108.7708867|0.4916117|-0.8896966|47.0970775 unknown
InChI: InChI=1S/C6H9N3O/c1-3-4(2)8-6(7)9-5(3)10/h8H,7H2,1-2H3
charge 0 multiplicity 1
19 atoms
O  -0.891773 2.41464 -0.040925
N  0.914791 -1.227495 0.016395
N  1.086262 1.161617 -0.0135
N  3.025934 -0.144819 0.01445
C  -0.500804 -1.205168 0.008035
C  -1.141871 0.016472 -0.011759
C  -1.132847 -2.578076 0.024103
C  -0.328718 1.27669 -0.023285
C  -2.638569 0.213122 -0.021818
C  1.645758 -0.039784 0.005355
H  1.38597 -2.133305 0.03053
H  -0.845258 -3.139961 0.934253
H  -0.816511 -3.174133 -0.854198
H  -2.228986 -2.513481 0.005371
H  -2.945174 0.807322 0.858299
H  -3.206836 -0.731042 -0.02935
H  -2.930972 0.813981 -0.901985
H  3.539573 0.733155 0.006083
H  3.528932 -1.027335 0.032343
