program: Gaussian 09
title: 000077636
version: EM64L-G09RevD.01
frameworkgroup: C1[X(C13H13OP)]
method: RPBEPBE
basis: SDD
operation: Freq
keyword: #p
keyword: freq=noraman
keyword: PBEPBE/SDD
title: #p freq=noraman PBEPBE/SDD
converged: YES YES NO NO
title: Mulliken charges:
elementType: P O C C C C C C C C C C C C C H H H H H H H H H H H H H
charge: 0.741202 -0.518496 -0.184415 -0.230075 -0.259240 -0.187289 -0.282241 -0.315289 -0.219946 -0.221903 -0.217847 -0.214169 -0.236502 -0.229536 -0.495135 0.239172 0.265873 0.280347 0.246326 0.227078 0.230366 0.226567 0.229282 0.227445 0.229910 0.215455 0.233762 0.219296
chargesum: 0.00000
title: Mulliken charges with hydrogens summed into heavy atoms:
elementType: P O C C C C C C C C C C C C C
charge: 0.741202 -0.518496 -0.184415 -0.230075 -0.020068 0.078584 -0.001894 -0.068963 0.007133 0.008464 0.008721 0.015113 -0.009057 0.000374 0.173378
polarizability: 2.03112114e+02 8.15974262e+00 1.57431671e+02 1.66852644e+01 4.06833611e+00 1.26134331e+02
1716.lowfreq: -3.0907 -0.0007 0.0011 0.0012 8.4461 11.5068 19.6093 26.0556 47.4200
frequency: 18.9759 25.9964 47.3870 57.2372 109.3652 125.6142 161.2960 177.5419 219.4404 247.7406 292.2078 313.7739 393.8694 395.4807 405.8239 423.6317 471.4704 519.0228 595.4639 612.0471 616.9262 672.2550 677.1113 700.7189 702.3959 749.9978 758.5444 856.0118 857.6919 926.3965 928.1851 979.5359 980.5453 984.2357 986.2062 989.7547 997.7923 1000.0706 1016.9518 1020.3577 1072.5531 1076.4464 1078.4697 1084.0371 1114.9033 1133.8237 1172.0786 1172.2268 1186.4608 1190.4895 1305.5255 1310.1706 1373.5623 1376.2061 1421.7440 1423.4617 1428.6302 1458.6953 1461.7958 1465.2115 1474.3696 1582.0618 1584.1087 1591.1939 1595.4275 2948.5093 3034.1076 3094.0012 3117.3263 3117.7684 3125.7785 3126.6275 3137.8070 3140.1596 3149.2186 3156.6989 3162.6274 3167.7860
redmass: 3.8685 3.8112 4.3825 3.5058 3.6313 1.6045 2.3604 3.6134 4.0255 5.0589 4.8486 5.7536 2.8830 2.8651 6.1359 8.2840 3.7607 4.1401 8.8929 6.4774 6.9908 6.6461 6.8308 2.0559 1.8595 1.5681 1.7403 1.2479 1.2453 1.3719 1.3676 1.4495 1.3995 5.8126 5.9353 8.4997 1.3191 1.3237 3.2914 3.1567 1.8704 1.7433 1.9503 2.5664 1.2544 1.3262 1.0537 1.0552 1.1206 1.1236 1.3351 1.3279 7.4218 8.6163 2.0947 2.1031 1.1305 1.0650 2.0315 2.0087 1.0537 5.9462 6.0344 5.8817 5.8668 1.0314 1.1040 1.1001 1.0861 1.0863 1.0869 1.0874 1.0915 1.0932 1.0961 1.0967 1.1016 1.0985
irintensity: 0.1277 0.0924 0.4354 2.7471 2.2240 2.3649 2.2647 2.7368 3.7731 0.7207 1.1749 1.9493 1.5650 1.1142 11.2108 15.3628 23.2268 33.5260 30.9752 0.4395 9.0813 3.6039 1.9371 51.9444 45.7768 67.2891 29.7338 0.0808 0.1791 2.5165 0.5096 2.9961 0.1351 50.3796 4.0906 91.4019 1.2459 0.0030 3.5945 9.4297 8.7309 16.0046 8.5502 5.4473 0.3934 0.9610 0.1108 0.0345 4.3294 1.8320 4.4851 2.6559 0.0619 0.2970 20.6430 7.5013 0.8854 13.9848 5.3838 19.4223 11.1430 1.2928 0.2574 1.0951 7.2511 98.8877 51.4425 23.2596 3.0535 1.9677 0.3012 1.6195 12.6021 28.3559 27.8540 24.1128 34.6366 21.3322
temp: 298.150 k
press: 1.00000 atm
elementType: 15 8 6 6 6 6 6 6 6 6 6 6 6 6 6 1 1 1 1 1 1 1 1 1 1 1 1 1
symmnumber: 1
zpe: 577958.6 jmol-1
zpe.correction: 0.220133 hartree
zpe.thermalcorrener: 0.234575 hartree
zpe.thermalcorrenthalpy: 0.235519 hartree
zpe.thermalcorrgfe: 0.176108 hartree
zpe.sumelectzpe: -918.553120 hartree
zpe.sumelectthermal: -918.538678 hartree
zpe.sumelectthermalent: -918.537733 hartree
zpe.sumelectthermalfe: -918.597145 hartree
dipole: -1.3414 -0.4412 0.2578
dipole: 1.4354
quadrupole: -86.1914 -87.2336 -93.4624
quadrupole: -0.2481 3.3788 1.3595
quadrupole: 2.7711 1.7289 -4.4999 -0.2481 3.3788 1.3595
hfenergy: -918.7732524 hartree
pointgroup: C01 [X(C13H13O1P1)]
dipole: 0.532624 0.1803658 0.0521639 debye
polarizability: 197.3900704|10.8951164|158.6045679|-24.711987|-2.9155647|130.6834782 unknown
InChI: InChI=1S/C13H13OP/c1-14-15(12-8-4-2-5-9-12)13-10-6-3-7-11-13/h2-11H,1H3
charge 0 multiplicity 1
28 atoms
P  -0.124183 -1.109953 -1.128548
O  -0.073196 -2.449128 0.078829
C  -1.546328 -0.209392 -0.279587
C  1.3296 -0.056515 -0.52351
C  -1.746223 1.171335 -0.532146
C  1.574384 0.149831 0.857649
C  -2.464682 -0.913343 0.536535
C  2.207479 0.503642 -1.48372
C  -2.855078 1.842897 0.029642
C  2.685139 0.917277 1.271511
C  -3.570852 -0.235934 1.100901
C  3.31431 1.282818 -1.068665
C  -3.771986 1.140288 0.846986
C  3.553544 1.488889 0.308992
C  0.819874 -3.565957 -0.259834
H  -1.033682 1.728828 -1.152584
H  0.897476 -0.293887 1.596296
H  -2.293982 -1.974813 0.73959
H  2.02985 0.329787 -2.552355
H  -2.99916 2.911403 -0.166731
H  2.871561 1.075087 2.339921
H  -4.273914 -0.785223 1.737612
H  3.987177 1.718582 -1.815848
H  -4.631697 1.661793 1.282894
H  4.412453 2.087954 0.6327
H  0.601773 -3.977516 -1.265556
H  0.628927 -4.338493 0.502973
H  1.885115 -3.263755 -0.213047
