program: Gaussian 09
title: 000077596
version: EM64L-G09RevD.01
frameworkgroup: C1[X(C5H8O2)]
method: RPBEPBE
basis: SDD
operation: Freq
keyword: #p
keyword: freq=noraman
keyword: PBEPBE/SDD
title: #p freq=noraman PBEPBE/SDD
converged: NO YES NO NO
title: Mulliken charges:
elementType: O O C C C C C H H H H H H H H
charge: -0.269833 -0.443605 -0.245706 -0.334526 -0.326855 0.189861 -0.453006 0.178947 0.209660 0.208107 0.237458 0.221396 0.216502 0.335775 0.275824
chargesum: 0.00000
title: Mulliken charges with hydrogens summed into heavy atoms:
elementType: O O C C C C C
charge: -0.269833 -0.107830 0.142901 0.111040 0.111043 0.189861 -0.177182
polarizability: 8.93352566e+01 1.12413166e+01 4.81368860e+01 -4.53149712e-01 -9.73335050e-01 4.14312294e+01
1716.lowfreq: -40.7566 -6.2345 -5.1026 -0.0011 -0.0011 -0.0010 45.6672 81.9361 94.0652
frequency: 44.7374 80.5887 94.0462 129.5195 209.6889 307.2561 317.0519 350.2980 386.9138 540.6277 633.0486 677.6265 819.0425 899.2489 954.2611 973.7272 987.9936 1033.8443 1053.5467 1085.1153 1149.6880 1199.4806 1261.6805 1293.4093 1330.3768 1363.1561 1400.2562 1460.8605 1473.5785 1484.1849 2155.1488 2909.2045 2921.1717 2961.7683 2978.8471 2998.2033 3110.9676 3427.8352 3562.7719
redmass: 3.0448 2.7709 4.6844 3.2360 4.4119 1.1237 3.1567 5.7949 4.5723 6.5629 1.2303 1.2540 1.0963 8.6768 4.3882 3.8346 1.6711 7.2669 1.5564 2.7322 1.1773 1.0648 1.1953 1.2042 1.2262 1.2296 1.4187 1.0857 1.0721 1.0816 6.0147 1.0597 1.0549 1.1038 1.0951 1.0719 1.0990 1.1606 1.0664
irintensity: 2.8370 3.6719 0.2370 15.2314 3.4852 173.4140 8.5074 0.8132 7.3698 3.6156 76.3585 59.3163 5.0130 28.6073 14.8153 77.2348 2.9145 203.0087 3.1594 7.2374 7.5883 2.3413 4.5805 0.5660 61.5630 0.2422 7.2247 3.9818 0.3458 7.2432 0.9040 53.1604 78.2824 46.4222 18.2718 77.7350 26.6201 57.6991 8.2361
temp: 298.150 k
press: 1.00000 atm
elementType: 8 8 6 6 6 6 6 1 1 1 1 1 1 1 1
symmnumber: 1
zpe: 311153.3 jmol-1
zpe.correction: 0.118512 hartree
zpe.thermalcorrener: 0.127332 hartree
zpe.thermalcorrenthalpy: 0.128277 hartree
zpe.thermalcorrgfe: 0.084396 hartree
zpe.sumelectzpe: -345.107051 hartree
zpe.sumelectthermal: -345.098231 hartree
zpe.sumelectthermalent: -345.097286 hartree
zpe.sumelectthermalfe: -345.141167 hartree
dipole: -0.7606 2.0249 -1.4190
dipole: 2.5870
quadrupole: -43.4413 -40.3632 -41.1728
quadrupole: 2.6918 -6.1270 -0.7559
quadrupole: -1.7822 1.2959 0.4863 2.6918 -6.1270 -0.7559
hfenergy: -345.2255629 hartree
pointgroup: C01 [X(C5H8O2)]
dipole: -0.3070512 -0.7913642 0.5615582 debye
dipolederiv: -1.175054 0.0014535 -0.0278987 -0.0881571 -0.3792394 0.0019345 -0.0143696 -0.0010347 -0.4244854 -0.9321456 0.0090574 -0.0886993 0.0029336 -0.5504916 -0.1544505 -0.1099664 -0.1284224 -0.1676885 0.6503051 -0.1218138 0.0114523 -0.3675961 0.2204566 -0.0313413 0.0292921 -0.0320908 0.4461878 0.6346672 -0.0936382 0.037988 -0.0039813 0.3722989 0.0451015 0.0739147 0.0352696 0.2745044 0.9652288 0.0285482 0.0116746 0.3035445 0.4218343 0.008829 0.0194344 0.0009453 0.4539378 -0.0986634 -0.0858739 -0.0057854 -0.0422271 -0.0917788 -0.0032372 -0.0033579 -0.0016014 -0.062278 -0.4373439 0.0490073 0.0003492 0.0523954 -0.2890881 0.002546 0.0036317 0.0007502 -0.3190272 -0.0624708 0.0149446 -0.0029831 0.0826932 -0.0642612 0.12438 -0.0660333 0.1570019 -0.1422561 -0.0258001 0.001117 -0.0171433 0.0677171 -0.062597 -0.1135083 0.0275641 -0.1355707 -0.102927 -0.016362 0.0508583 0.0184411 0.0202811 -0.04913 -0.1096775 0.0264568 -0.1539654 -0.0749736 0.045109 0.0173478 -0.0027352 0.0118634 0.0194546 0.0812486 -0.0146842 0.1111121 -0.048083 -0.0620675 0.0444864 0.0376734 -0.0630626 -0.0249016 -0.0999791 -0.0074421 -0.140756 -0.0813559 -0.0620264 0.0449882 -0.0343668 -0.0647003 -0.0526646 0.1011482 0.0007565 0.1479483 -0.0619617 0.3460144 0.0231668 0.0613344 0.0649192 0.2918647 0.1483233 0.034419 0.1415368 0.041131 0.2306092 0.0163504 0.000699 0.0233773 0.2382431 -0.0013172 0.0003843 -0.0011228 0.2692754 unknown
polarizability: 89.232762|-11.3930988|48.2127816|0.926575|-1.1185579|41.4578283 unknown
InChI: InChI=1S/C5H8O2/c1-2-4-7-5-3-6/h1,6H,3-5H2
charge 0 multiplicity 1
15 atoms
O  -0.059112 0.194655 0.028118
O  3.66328 0.008394 -0.020916
C  1.238021 -0.498863 0.025034
C  2.313945 0.595817 0.001754
C  -1.180419 -0.763621 -0.030264
C  -2.454558 -0.037372 -0.00513
C  -3.545644 0.533999 0.012688
H  1.338638 -1.133645 0.936568
H  1.340249 -1.151658 -0.86843
H  2.173871 1.280824 0.861646
H  2.240146 1.178135 -0.928787
H  -1.110108 -1.370492 -0.960209
H  -1.128546 -1.461122 0.835593
H  3.842947 -0.427172 0.850355
H  -4.490912 1.045519 0.027579
