program: Gaussian 09
title: 000077610
version: EM64L-G09RevD.01
frameworkgroup: C1[X(C13H12O)]
method: RPBEPBE
basis: SDD
operation: Freq
keyword: #pfreq=noraman
keyword: PBEPBE/SDD
title: #p freq=noraman PBEPBE/SDD
converged: YES YES NO NO
title: Mulliken charges:
elementType: O C C C C C C C C C C C C C H H H H H H H H H H H H
charge: -0.314799 0.306126 0.191937 -0.382185 -0.359427 0.362051 -0.785200 -0.244583 -0.225014 -0.364782 -0.391600 -0.206111 -0.194651 -0.253776 0.232818 0.266410 0.239302 0.243001 0.214625 0.226853 0.228378 0.268602 0.256463 0.227477 0.228675 0.229408
chargesum: 0.00000
title: Mulliken charges with hydrogens summed into heavy atoms:
elementType: O C C C C C C C C C C C C C
charge: -0.314799 0.306126 0.191937 -0.149367 -0.093017 0.362051 -0.088272 -0.017731 0.003365 -0.096179 -0.135136 0.021366 0.034024 -0.024367
polarizability: 2.05017029e+02 2.25628864e+00 1.30093120e+02 -8.96195643e+00 -7.48966408e+00 8.81460911e+01
1716.lowfreq: -10.5544 -5.8397 -0.0004 -0.0002 0.0007 1.4521 28.4006 41.9586 80.3956
frequency: 28.3437 41.8566 80.3878 100.8373 172.3620 200.6409 241.2989 256.1917 333.2583 409.5714 410.5606 438.9466 475.7306 511.2707 538.4165 574.1185 603.8764 618.3473 691.0751 707.6104 731.9126 755.4402 772.0782 785.1773 833.4018 856.5987 862.9396 904.4308 939.7607 966.8880 978.2166 983.3557 985.4879 986.3774 1019.4739 1042.6033 1045.8703 1077.5052 1105.4017 1158.8812 1168.9121 1171.0319 1177.7240 1200.2417 1230.9442 1280.2024 1308.7298 1376.5653 1386.0016 1400.9178 1427.1204 1441.5085 1458.2225 1470.8745 1475.6398 1482.5932 1590.7778 1593.3508 1609.6112 1610.0784 2984.9623 3064.3169 3092.5848 3124.1427 3129.9073 3135.7906 3139.1119 3152.7403 3156.0537 3164.5245 3167.4658 3173.8883
redmass: 4.5935 3.7418 3.4984 1.1070 3.4761 3.8692 4.3723 3.8813 5.4471 3.2711 3.1241 2.9761 3.5982 3.8647 4.4575 7.1338 5.7169 6.3786 2.3255 3.8526 2.4926 1.3733 1.8896 4.9687 1.2589 2.7902 1.6954 1.4184 1.3678 1.3626 1.3111 1.5938 1.7511 2.8011 2.1002 2.0296 1.5341 1.5070 2.1620 1.7105 1.1207 1.0698 1.3709 2.8161 3.0694 1.4817 1.3395 6.5943 8.1437 1.2745 1.9930 2.3182 1.0500 2.2312 1.3036 2.1937 6.3955 6.2335 6.3950 7.0598 1.0366 1.0967 1.1003 1.0865 1.0849 1.0890 1.0892 1.0938 1.0930 1.0963 1.1003 1.1004
irintensity: 1.7460 0.2209 0.2335 0.4443 0.9025 0.6303 2.8336 4.3613 6.9906 0.2938 0.5412 8.7431 13.9171 5.0416 0.0622 0.2442 0.8903 0.3007 28.8138 3.7956 7.8341 130.0645 36.2993 5.1549 0.8688 28.1949 11.5778 5.4170 0.8668 0.1601 0.1906 2.6835 0.3600 0.8108 11.6069 11.8507 9.5583 12.6931 56.7052 15.8758 3.5452 5.2556 43.4918 197.8284 192.5070 3.3115 0.5297 0.5430 1.6744 14.7288 26.1813 2.4548 12.0373 191.4227 6.6797 63.3312 43.2603 56.9389 1.5873 29.1527 26.3783 16.1958 24.3985 7.6140 1.7804 11.5050 12.6642 39.9060 15.9432 12.6815 19.3732 7.6299
temp: 298.150 k
press: 1.00000 atm
elementType: 8 6 6 6 6 6 6 6 6 6 6 6 6 6 1 1 1 1 1 1 1 1 1 1 1 1
symmnumber: 1
zpe: 547728.4 jmol-1
zpe.correction: 0.208619 hartree
zpe.thermalcorrener: 0.220655 hartree
zpe.thermalcorrenthalpy: 0.221599 hartree
zpe.thermalcorrgfe: 0.169049 hartree
zpe.sumelectzpe: -576.816087 hartree
zpe.sumelectthermal: -576.804051 hartree
zpe.sumelectthermalent: -576.803107 hartree
zpe.sumelectthermalfe: -576.855657 hartree
dipole: 0.1631 -0.6630 0.4107
dipole: 0.7968
quadrupole: -70.9496 -77.6301 -83.1628
quadrupole: -1.0663 -2.5069 -1.6081
quadrupole: 6.2979 -0.3826 -5.9154 -1.0663 -2.5069 -1.6081
hfenergy: -577.0247062 hartree
pointgroup: C01 [X(C13H12O1)]
dipole: -0.0564779 0.1925629 0.2408148 debye
dipolederiv: -2.3236805 -0.0303184 0.0286728 0.1685876 -0.3193703 -0.0788864 -0.2735955 -0.0786339 -0.2569282 -0.3525053 -0.0249539 -0.0095338 0.063109 0.3230052 0.0613896 -0.0250359 0.0568917 -0.0360644 1.5173766 0.2314404 0.1023249 0.4807211 0.1049567 -0.0123807 0.5720574 0.0309813 0.0579886 0.1122395 -0.0776233 0.0463231 -0.0043677 -0.0248288 -0.0051731 0.0645616 -0.006602 -0.1563204 -0.2262876 0.0016897 0.0296386 -0.2828476 -0.08998 -0.0140363 -0.0587895 -0.0004203 -0.1503275 1.7127318 -0.1460145 -0.1557418 -0.6416308 0.0940749 0.0591051 -0.2856842 0.032396 0.1866036 0.0822882 -0.1078716 0.0020479 -0.0765091 -0.1163751 -0.0300179 0.0097189 -0.0641952 0.0577082 -0.0283732 0.0689324 0.0528957 0.0053511 -0.093294 0.0243964 0.0269218 0.0260649 -0.1589839 0.0554681 -0.0418792 0.044601 0.0407422 0.096487 0.017973 0.0591182 0.0120891 -0.1464699 -0.2954788 -0.0025387 0.0283841 0.1957249 -0.1627325 0.0116435 0.3094203 -0.002779 -0.1138756 -0.4398211 0.0105164 0.0555986 -0.0480965 -0.12515 0.0815452 -0.09381 0.0955375 0.0013347 0.1355583 -0.0256169 0.0451529 -0.0680208 -0.0817677 0.1038277 -0.0264631 0.1053016 0.1069415 0.1471916 -0.029646 0.0208063 -0.0309604 -0.1006534 0.0919883 0.0629963 0.0795265 0.0733657 -0.0621328 -0.061014 -0.0572536 -0.0329572 -0.1650753 0.0261662 -0.0389653 0.0288187 -0.1662691 -0.051328 0.0926299 -0.0297213 0.1215459 -0.0009442 0.0155031 -0.0396385 0.0064757 0.1446782 0.0036856 0.0809529 -0.0399137 0.1134499 0.0487306 0.0023235 -0.062898 -0.0016556 0.136119 0.0140014 -0.0785015 0.1031737 -0.0502726 0.0175479 0.0197641 0.0972458 0.0656185 0.0262923 0.1152878 -0.0137998 -0.0628933 -0.0051223 0.0169228 -0.0289829 -0.0398846 -0.0872686 -0.0842381 -0.1167403 0.1506383 -0.0492985 0.0500538 0.0165452 0.0096942 -0.0611195 0.0439551 0.091727 -0.0933009 -0.0805588 -0.0575405 -0.077868 0.046429 -0.0237359 -0.0674721 -0.0296181 0.1505684 0.0684849 -0.0112334 -0.013312 -0.0447941 -0.1211233 -0.0158831 -0.0143875 -0.021426 0.1548725 0.0160548 -0.0017737 -0.084077 0.0066129 0.1277549 -0.0348994 -0.1270039 -0.0271617 0.0601067 0.1101468 0.0333183 0.0371186 0.0279348 0.1256722 -0.0843596 0.0281148 -0.0799235 -0.0120608 0.0621037 0.0171215 0.0208717 0.0281742 0.1080651 -0.1017704 0.0526243 -0.0963697 -0.0692876 -0.0550164 -0.0161941 -0.1037764 -0.0122439 0.1372949 -0.0475656 -0.1151912 -0.0442414 0.015403 -0.107954 0.0622977 0.0454519 0.0736836 0.1378081 -0.0476287 0.0471597 -0.0433616 0.0871159 unknown
polarizability: 204.844753|-4.159091|120.6325631|9.792126|18.8184356|97.7789246 unknown
InChI: InChI=1S/C13H12O/c1-11-7-5-6-10-13(11)14-12-8-3-2-4-9-12/h2-10H,1H3
charge 0 multiplicity 1
26 atoms
O  -0.110333 -0.750977 -0.599937
C  2.213358 -0.9822 -0.024619
C  1.099105 -0.118179 -0.202499
C  3.457409 -0.380963 0.286026
C  1.214472 1.285725 -0.093294
C  -1.372787 -0.257969 -0.185608
C  2.058076 -2.48169 -0.175547
C  3.593902 1.020924 0.41301
C  2.468741 1.854045 0.21972
C  -1.592857 0.327028 1.084261
C  -2.442859 -0.47556 -1.081849
C  -2.90518 0.70542 1.44537
C  -3.74923 -0.095593 -0.704475
C  -3.986907 0.499612 0.557143
H  4.33067 -1.028144 0.430833
H  0.340632 1.923013 -0.261386
H  1.240974 -2.865585 0.461382
H  1.794841 -2.752279 -1.214871
H  2.991579 -3.004456 0.093815
H  4.568658 1.45725 0.655788
H  2.563554 2.942253 0.302704
H  -0.75948 0.473689 1.778195
H  -2.236242 -0.938395 -2.051497
H  -3.080767 1.155514 2.428918
H  -4.580566 -0.262829 -1.398198
H  -5.001061 0.795245 0.845716
