program: Gaussian 09
title: 000077598
version: EM64L-G09RevD.01
frameworkgroup: C1[X(C5H7Cl3O2)]
method: RPBEPBE
basis: SDD
operation: Freq
keyword: #p
keyword: freq=noraman
keyword: PBEPBE/SDD
title: #p freq=noraman PBEPBE/SDD
converged: YES YES NO NO
title: Mulliken charges:
elementType: Cl Cl Cl O O C C C C C H H H H H H H
charge: 0.144163 0.107686 0.113874 -0.236472 -0.196743 0.031170 -0.677398 -0.672886 0.503271 -0.740848 0.240038 0.212918 0.238668 0.230496 0.220177 0.252749 0.229136
chargesum: 0.00000
title: Mulliken charges with hydrogens summed into heavy atoms:
elementType: Cl Cl Cl O O C C C C C
charge: 0.144163 0.107686 0.113874 -0.236472 -0.196743 0.271209 0.004683 0.029176 0.503271 -0.740848
polarizability: 9.85128463e+01 5.90120251e+00 8.80196444e+01 5.42927596e+00 1.37953554e+00 8.15054514e+01
1716.lowfreq: -11.6010 -0.0022 0.0003 0.0031 2.5589 8.4593 20.2535 58.3324 72.9739
frequency: 20.0598 58.3248 72.9668 103.3856 175.2238 187.0891 196.6573 213.5031 238.5582 262.8847 274.6317 312.6051 378.5399 397.3182 401.6514 459.3811 611.3172 691.0967 731.9454 758.0794 797.1518 885.3526 930.1808 937.2881 945.6775 1094.7007 1157.0772 1166.0170 1191.9482 1325.7066 1333.6620 1384.8554 1400.8135 1456.6879 1464.7763 1473.1114 1486.4327 1637.8276 2994.5000 2997.9556 3030.3645 3090.7822 3098.1096 3103.8798 3109.0660
redmass: 4.4991 4.9561 5.3445 5.8739 9.3483 1.0517 4.6875 3.3126 1.6052 19.7010 8.9655 4.8006 7.0514 3.6654 6.0804 2.7525 12.9045 7.6158 7.3026 12.2189 6.2899 2.8768 1.2207 2.5447 2.1510 1.7092 2.3362 3.6821 2.2019 1.2814 1.4974 1.2533 1.2244 1.0511 1.0467 1.0506 1.0486 12.1330 1.0356 1.0361 1.0870 1.0993 1.0988 1.1012 1.1008
irintensity: 0.3596 1.1478 0.6835 0.5495 0.7649 0.0982 0.7691 5.0453 2.0188 0.0812 2.9266 1.1589 1.1202 8.6225 4.4778 2.6982 128.1774 19.6992 78.1263 57.7121 97.4832 0.7725 2.9468 71.3144 41.7086 132.3620 56.6825 216.9420 27.4737 9.7830 3.7551 35.3542 19.3186 7.1029 4.4516 7.5581 21.6908 155.2718 10.5786 14.1167 6.2585 3.7990 38.3173 11.7494 30.0693
temp: 298.150 k
press: 1.00000 atm
elementType: 17 17 17 8 8 6 6 6 6 6 1 1 1 1 1 1 1
symmnumber: 1
zpe: 299300.5 jmol-1
zpe.correction: 0.113998 hartree
zpe.thermalcorrener: 0.126267 hartree
zpe.thermalcorrenthalpy: 0.127211 hartree
zpe.thermalcorrgfe: 0.073486 hartree
zpe.sumelectzpe: -1724.550177 hartree
zpe.sumelectthermal: -1724.537908 hartree
zpe.sumelectthermalent: -1724.536964 hartree
zpe.sumelectthermalfe: -1724.590688 hartree
dipole: 3.5602 0.6548 0.3733
dipole: 3.6391
quadrupole: -69.3684 -82.2558 -80.6526
quadrupole: 0.0950 -0.3516 -3.5485
quadrupole: 8.0572 -4.8302 -3.2270 0.0950 -0.3516 -3.5485
hfenergy: -1724.6641747 hartree
pointgroup: C01 [X(C5H7Cl3O2)]
dipole: -1.4114031 0.1811966 -0.158132 debye
dipolederiv: -0.4860794 0.2980689 -0.1597421 0.2664435 -0.3121651 0.1017053 -0.1387227 0.101236 -0.1754509 -0.1850299 -0.0169676 0.0328265 -0.0344476 -0.1515291 0.111875 0.0160332 0.0817145 -0.7670412 -0.1710041 -0.0056184 -0.0008859 -0.0026854 -0.6039439 -0.3140603 0.026037 -0.2760461 -0.3126815 -1.7509729 0.1608962 -0.1750216 0.2671884 -0.5042961 0.0730569 -0.1393258 0.046859 -0.2974713 -0.6346788 -0.1475144 0.0343182 0.2225862 -0.7512387 0.22933 -0.1084691 0.2000525 -0.331413 1.1001812 -0.0299124 0.068935 0.1543916 0.3125936 0.0873723 -0.0419644 0.1135489 0.3513623 -0.1075864 0.0623907 -0.005948 0.0591512 -0.0628758 -0.0609329 0.0303243 -0.0612757 0.036159 -0.119624 0.0223145 -0.0181881 -0.0466871 -0.0557868 -0.0980834 -0.0013847 -0.1330424 -0.0733015 1.605602 0.0825562 0.0566493 -0.3920015 0.9009091 -0.3978785 0.1928206 -0.3436831 0.1986749 0.6618263 -0.3877527 0.1658403 -0.4253924 1.0488779 0.1369363 0.1811188 0.1417829 1.3265186 -0.0285596 0.0335678 -0.0528175 -0.047263 0.0033878 0.0630211 0.0099203 0.0442947 -0.0657308 -0.1328773 -0.0472734 0.0293772 -0.0684053 0.05692 0.0196032 0.0205537 0.011865 0.1112284 0.1050896 -0.0354749 -0.063761 0.000749 0.0101323 -0.0995888 -0.0489461 -0.1023398 -0.044497 0.111407 -0.0098104 0.0311937 0.0302507 0.0250405 0.0684258 -0.0043542 0.1184293 -0.0615639 -0.1262715 -0.0870448 0.0104145 -0.0925704 0.093275 -0.0048098 0.0024388 0.0096277 0.0846168 0.0374404 0.1244657 0.0281465 0.1089297 -0.0158121 -0.0332898 0.0097991 -0.0109558 0.0717227 0.1211375 -0.016891 0.0186631 -0.0002377 0.0065114 0.1173177 -0.0058788 0.0579323 -0.0511316 unknown
polarizability: 99.0242609|-6.2996593|87.265226|4.7079722|0.354068|81.7484552 unknown
InChI: InChI=1S/C5H7Cl3O2/c1-3(2)10-4(9)5(6,7)8/h3H,1-2H3
charge 0 multiplicity 1
17 atoms
Cl 3.106825 -0.719181 0.545777
Cl 1.822212 0.65359 -1.821638
Cl 1.704395 1.924705 0.942257
O  -0.712463 0.378484 -0.055618
O  0.266568 -1.596214 0.718703
C  -2.110075 -0.20258 0.114612
C  -3.018221 1.011611 0.30047
C  -2.428297 -1.056832 -1.118077
C  0.339317 -0.434394 0.274158
C  1.679524 0.31209 0.00878
H  -2.076835 -0.83192 1.023508
H  -4.057855 0.673839 0.461087
H  -2.706589 1.609281 1.173434
H  -2.995436 1.65847 -0.593444
H  -3.450453 -1.466961 -1.027554
H  -1.72744 -1.903707 -1.207517
H  -2.378078 -0.447182 -2.036841
