program: Gaussian 09
title: 000077593
version: EM64L-G09RevD.01
frameworkgroup: C1[X(C7H4N2O3)]
method: RPBEPBE
basis: SDD
operation: Freq
keyword: #pfreq=noraman
keyword: PBEPBE/SDD
title: #p freq=noraman PBEPBE/SDD
converged: NO NO NO NO
title: Mulliken charges:
elementType: O O O N N C C C C C C C H H H H
charge: -0.231054 -0.183043 -0.176453 -0.425411 0.040777 -0.112948 0.289529 0.209621 -0.277557 0.186984 -0.124050 -0.358548 0.280267 0.375840 0.246487 0.259560
chargesum: 0.00000
title: Mulliken charges with hydrogens summed into heavy atoms:
elementType: O O O N N C C C C C C C
charge: -0.231054 -0.183043 -0.176453 -0.049571 0.040777 -0.112948 0.289529 0.209621 0.002710 0.186984 0.122437 -0.098988
polarizability: 1.40676091e+02 1.34109246e-01 1.08459103e+02 -9.62030587e-03 -1.35192518e-02 3.82398061e+01
1716.lowfreq: -2.5292 -0.0003 0.0005 0.0012 7.6425 9.3451 83.2805 133.6009 150.0695
frequency: 83.2536 133.5983 150.0676 267.6469 275.0972 348.3536 425.3708 430.0707 463.0005 515.7891 522.3132 614.1910 651.9422 656.2683 679.3568 735.6994 769.9051 798.9664 816.6041 827.8370 879.2857 933.0177 987.7320 1038.8200 1066.8361 1123.5265 1160.4110 1201.1312 1240.1540 1312.1575 1335.0728 1385.9072 1412.2908 1433.6589 1549.7556 1579.8771 1662.0189 1717.8442 3147.3772 3166.4357 3186.8462 3509.3146
redmass: 7.8248 5.8950 8.4288 5.8751 7.7203 12.8697 11.0736 4.1295 8.2579 4.3022 10.9940 7.0771 8.2913 2.7453 7.3678 8.2158 1.6961 4.4661 1.3942 5.9077 9.8705 1.3767 1.3823 2.4258 4.3255 1.7823 6.0610 2.0677 3.2983 2.7104 11.2079 1.5061 2.6946 2.2901 6.5930 7.1944 7.8342 9.4904 1.0889 1.0940 1.0991 1.0768
irintensity: 0.0800 4.9716 9.5246 0.2974 0.3618 14.9063 5.4158 0.0005 8.6734 0.1338 3.4355 10.0435 2.5332 0.2831 0.0016 5.9462 143.8204 33.6427 46.2293 27.5809 57.8311 0.0374 1.4748 3.3400 7.2145 49.8429 112.7813 131.3571 55.7021 192.3201 11.6282 4.1188 65.3998 44.2249 7.8270 59.0923 294.6063 611.5614 3.5152 14.6377 3.3714 69.4489
temp: 298.150 k
press: 1.00000 atm
elementType: 8 8 8 7 7 6 6 6 6 6 6 6 1 1 1 1
symmnumber: 1
zpe: 276306.3 jmol-1
zpe.correction: 0.105240 hartree
zpe.thermalcorrener: 0.113953 hartree
zpe.thermalcorrenthalpy: 0.114897 hartree
zpe.thermalcorrgfe: 0.070976 hartree
zpe.sumelectzpe: -603.497424 hartree
zpe.sumelectthermal: -603.488711 hartree
zpe.sumelectthermalent: -603.487767 hartree
zpe.sumelectthermalfe: -603.531687 hartree
dipole: 3.4094 -2.5087 -0.0023
dipole: 4.2329
quadrupole: -61.5859 -79.8759 -67.5689
quadrupole: -13.6613 0.0088 0.0039
quadrupole: 8.0910 -10.1990 2.1080 -13.6613 0.0088 0.0039
hfenergy: -603.6026638 hartree
pointgroup: C01 [X(C7H4N2O3)]
dipole: 1.3077801 -1.0310953 -0.0009074 debye
dipolederiv: -1.7757972 -0.1300758 0.000311 0.1748144 -0.428474 -0.0001882 -0.0004515 0.0002028 -0.1846792 -0.5348057 0.1153201 -0.0000022 0.0227149 -1.1033615 -0.0000265 -0.0000784 -0.0001012 -0.3202491 -1.3469506 -0.3595393 -0.0003557 -0.3602013 -0.6353575 -0.0002168 0.0015181 0.0006846 -0.3470474 -0.8927422 -0.4825859 -0.0000432 -0.4447657 -1.0591451 0.00037 -0.0002061 -0.0001359 -0.3541993 -0.1256291 -0.1819918 0.0000514 0.030951 -0.2181459 0.0000208 0.000044 0.0000135 -0.2021742 -0.3226723 0.3086649 -0.000071 -0.0565849 -0.1739921 -0.0000249 0.0000363 0.000047 0.0418369 0.9722633 0.2780368 -0.0001134 0.4106222 0.1358918 0.0000663 -0.0002031 0.0000766 0.1521478 1.397842 0.1167019 0.0001571 0.0332127 1.5127137 0.0000955 0.000161 0.0000692 0.2664947 -0.2216887 -0.0829547 0.0000207 0.0488518 0.155071 -0.0000696 -0.0001327 -0.000141 -0.1271973 2.3941104 0.3243515 0.0000552 0.0759912 1.4647372 0.0000041 -0.0008034 -0.0006303 0.3919877 0.0164195 -0.0039357 0.0000091 -0.2330612 0.0628762 -0.0000321 0.0001202 -0.0000462 -0.07211 0.213761 0.1383784 -0.0000398 0.3214577 -0.0158765 -0.0000447 -0.0000707 -0.0000365 -0.0710999 0.1085713 -0.0334881 0.0000168 -0.0151238 0.0060762 0.0000368 -0.0000086 0.0000386 0.1705354 0.2127717 -0.0547523 0.0000016 -0.0373866 0.1751291 -0.0000389 0.0001004 -0.0001125 0.3517035 -0.0210626 0.0829038 -0.0000166 0.0873952 0.0475298 0.0000295 -0.0000243 0.0000569 0.1575847 -0.0743908 -0.0350338 0.0000192 -0.0588875 0.0743277 0.0000187 -0.0000011 0.0000144 0.1464655 unknown
polarizability: 140.6493406|-0.9375964|108.4858532|-0.0100648|-0.0131917|38.2398061 unknown
InChI: InChI=1S/C7H4N2O3/c10-6-5-4(2-1-3-8-5)12-7(11)9-6/h1-3,9H
charge 0 multiplicity 1
16 atoms
O  -0.953721 -1.428195 0.000108
O  -0.682831 2.726851 -0.00018
O  -3.247622 -1.174355 0.00092
N  -1.910839 0.751369 -0.000543
N  1.761646 1.13906 -0.000588
C  0.51591 0.578407 -0.000461
C  0.321909 -0.827541 -0.000098
C  -0.676489 1.475633 -0.000418
C  1.433941 -1.695773 0.000132
C  -2.134764 -0.631654 -0.000817
C  2.714762 -1.112698 -0.000075
C  2.831941 0.304364 -0.000434
H  1.277002 -2.777516 0.000427
H  -2.760536 1.327286 -0.000188
H  3.613017 -1.737817 0.000095
H  3.815475 0.785279 -0.000581
