program: Gaussian 09
title: 000077604
version: EM64L-G09RevD.01
frameworkgroup: C1[X(C10H9ClO3)]
method: RPBEPBE
basis: SDD
operation: Freq
keyword: #p
keyword: freq=noraman
keyword: PBEPBE/SDD
title: #p freq=noraman PBEPBE/SDD
converged: YES YES NO NO
title: Mulliken charges:
elementType: Cl O O O C C C C C C C C C C H H H H H H H H H
charge: -0.037900 -0.221349 -0.409819 -0.239555 -0.503898 -0.487032 0.125590 0.298856 -0.331062 -0.334338 -0.223233 -0.217204 0.177673 -0.101259 0.255479 0.257190 0.275112 0.274074 0.256958 0.284076 0.260922 0.262426 0.378292
chargesum: 0.00000
title: Mulliken charges with hydrogens summed into heavy atoms:
elementType: Cl O O O C C C C C C C C C C
charge: -0.037900 -0.221349 -0.031528 -0.239555 0.008771 0.062154 0.125590 0.298856 -0.074104 -0.050262 0.037690 0.045223 0.177673 -0.101259
polarizability: 1.99845574e+02 1.39592627e+01 1.24428873e+02 1.50645633e-01 -4.39922205e-02 5.70583278e+01
1716.lowfreq: -19.2356 -5.8195 0.0024 0.0026 0.0027 4.0673 8.3598 30.5242 61.6671
frequency: -19.1135 30.5182 61.6573 69.1844 77.4017 102.7363 167.7811 209.5955 251.6732 263.2022 306.9008 384.4305 407.4891 455.4965 491.9737 498.3736 510.6810 559.6180 574.9255 622.6018 641.0142 683.3587 715.3029 773.0327 787.9858 831.5237 850.5490 889.4690 962.0724 979.7990 991.7432 1002.1676 1016.4645 1050.2492 1072.1463 1105.7514 1110.3567 1144.7414 1183.7188 1209.0049 1250.0052 1268.1826 1294.4541 1314.3586 1370.4342 1378.4090 1400.1807 1432.7322 1438.7725 1476.1386 1562.5480 1589.6075 1604.3810 1661.9832 2988.2843 3020.0000 3034.7316 3071.4261 3148.6776 3155.1013 3174.0462 3177.2979 3513.1995
redmass: 8.4914 5.2524 8.9896 4.2929 3.4058 2.6507 7.9770 9.0279 6.0981 8.1454 8.6292 6.7715 2.8858 3.2641 5.1011 1.8223 5.2688 2.2468 5.5476 7.1365 1.3068 6.9650 3.4458 6.3467 1.6071 1.3389 1.4296 3.8937 1.3673 5.7232 1.3802 3.6759 2.2811 2.4149 2.7946 2.2613 1.4493 1.2092 1.1408 1.7997 1.8652 1.1130 1.2668 2.3946 3.6880 2.5186 3.9716 1.1072 1.1176 2.3383 8.0085 6.9394 7.5840 8.1469 1.0614 1.0617 1.0975 1.0986 1.0892 1.0889 1.0961 1.0974 1.0640
irintensity: 3.9310 0.0257 0.7077 2.9882 0.9303 0.0688 9.2498 0.8672 0.0133 0.2222 0.7949 23.6610 0.0221 10.1076 2.4731 29.3037 80.4000 14.0009 16.4503 0.8478 127.0793 3.6146 0.4267 26.3867 66.3535 5.1775 28.4795 0.3315 0.1216 17.4053 0.2759 43.0979 1.7015 320.0775 43.7336 33.0472 14.8103 0.0578 19.9773 31.9114 45.2477 0.8164 2.0062 284.6636 34.3086 1.3918 19.4104 11.3193 44.8974 13.1626 118.4799 137.9703 41.4609 175.5911 18.7999 10.0654 3.8949 6.0377 4.8666 0.3125 4.3478 1.7434 25.2205
temp: 298.150 k
press: 1.00000 atm
elementType: 17 8 8 8 6 6 6 6 6 6 6 6 6 6 1 1 1 1 1 1 1 1 1
symmnumber: 1
zpe: 438859.9 jmol-1
zpe.correction: 0.167153 hartree
zpe.thermalcorrener: 0.179743 hartree
zpe.thermalcorrenthalpy: 0.180688 hartree
zpe.thermalcorrgfe: 0.126041 hartree
zpe.sumelectzpe: -1071.192348 hartree
zpe.sumelectthermal: -1071.179758 hartree
zpe.sumelectthermalent: -1071.178814 hartree
zpe.sumelectthermalfe: -1071.233461 hartree
dipole: 0.4739 -0.9955 0.0516
dipole: 1.1038
quadrupole: -84.3768 -93.5520 -88.4425
quadrupole: -4.2312 0.1334 -0.1846
quadrupole: 4.4136 -4.7616 0.3480 -4.2312 0.1334 -0.1846
hfenergy: -1071.3595013 hartree
pointgroup: C01 [X(C10H9Cl1O3)]
dipole: 0.2014022 -0.3841162 0.0215463 debye
dipolederiv: -0.9016096 -0.2280755 0.0015754 -0.240666 -0.1855714 0.0010175 0.001668 0.00101 -0.0587802 -0.8871258 -0.1163642 0.0008423 -0.4002868 -0.8367838 0.0060611 0.00481 0.0055297 -0.2995398 -1.3270666 -0.4039059 -0.0151083 -0.3268276 -0.3845282 -0.00208 -0.0156181 -0.0025088 -0.4292603 -0.7661947 0.0673291 -0.0009199 -0.157737 -0.9301845 -0.0150921 -0.0066857 -0.0119836 -0.3099522 -0.2704659 0.1183782 -0.0022121 0.3681798 -0.198508 0.0027951 -0.0023841 0.0009798 0.1384337 -0.1390432 0.089189 -0.0005483 0.3023662 -0.1873495 -0.0018254 -0.0035718 0.0004878 0.1235731 1.884649 0.1795838 0.0001843 0.2391904 0.8905454 -0.0086047 -0.0002404 -0.0079004 0.1157914 -0.9244035 -0.1838873 0.0013122 -0.1098129 -0.1564382 0.0011778 -0.0003995 0.0013168 -0.02989 0.2158806 -0.0254093 0.0004213 0.2164679 0.0742805 -0.0016876 -0.002289 -0.0016614 -0.1156167 0.184022 0.1537924 -0.0012574 -0.1715304 0.0399201 -0.0011196 0.0022303 -0.0011391 -0.0914117 -0.5689752 -0.0150562 -0.0001087 0.0801665 0.0343102 -0.001205 -0.0009551 -0.0012086 -0.1080374 -0.3176643 -0.2517327 0.0021525 -0.2836783 -0.1523775 0.000255 0.0024692 0.0002527 -0.1088612 1.7521996 0.1535142 0.0155394 0.1876321 1.2341967 0.0233776 0.0199605 0.0208844 0.1883178 1.3325448 0.3332269 -0.0021629 0.3198915 0.3112474 -0.0031288 -0.0020394 -0.0030938 -0.0518442 0.0443333 -0.0202124 0.0400286 -0.0804096 0.0444594 0.0745038 0.0520256 0.0742943 -0.0064981 0.0494149 -0.0204659 -0.0391101 -0.0833769 0.0439925 -0.0744356 -0.0514941 -0.0732629 -0.0023797 0.0753434 0.0121657 0.0233256 -0.0626969 0.0807737 0.0661955 0.0230327 0.0672202 0.0132659 0.0702476 0.0107271 -0.0240574 -0.0608487 0.0797696 -0.0667317 -0.0207053 -0.0693887 0.0120107 0.0083484 0.0870859 -0.0008889 0.1017106 0.0340391 0.001024 -0.0010158 0.0009865 0.1420284 0.1240194 -0.0493699 0.000382 0.0055908 0.0134995 0.0012205 -0.0002021 0.0012512 0.1531602 0.0757115 -0.0379011 0.0003246 -0.0402898 -0.0263507 0.0017326 0.0003128 0.0016882 0.1662469 -0.0001621 0.0675055 -0.0007075 0.0608685 0.045709 0.0011232 -0.0006717 0.0010967 0.165547 0.2859965 0.0798826 0.0009933 0.1360967 0.1313488 -0.0045732 0.0017629 -0.004851 0.3936962 unknown
polarizability: 198.6587369|16.8218215|125.614632|0.0202368|-0.2901733|57.0594056 unknown
InChI: InChI=1S/C10H9ClO3/c11-8-3-1-7(2-4-8)9(12)5-6-10(13)14/h1-4,13H,5-6H2
charge 0 multiplicity 1
23 atoms
Cl -5.378575 -0.976016 0.007643
O  0.715435 2.119898 -0.019767
O  5.355623 0.111256 0.01996
O  3.978421 -1.756367 -0.031099
C  1.601432 -0.149113 0.006531
C  2.985414 0.513674 0.004322
C  0.46774 0.877048 -0.005829
C  -0.949991 0.381216 -0.001822
C  -1.279761 -1.001361 0.010569
C  -1.999462 1.340618 -0.011276
C  -2.626489 -1.420472 0.013451
C  -3.348119 0.939044 -0.008422
C  4.099948 -0.510438 -0.004345
C  -3.640246 -0.441487 0.003916
H  1.49444 -0.806631 0.891433
H  1.500032 -0.822441 -0.867031
H  3.105898 1.179837 -0.869681
H  3.113353 1.175595 0.880064
H  -0.493741 -1.763121 0.017763
H  -1.730005 2.401738 -0.020925
H  -2.884782 -2.482962 0.022857
H  -4.15624 1.67574 -0.01562
H  6.067377 -0.585158 0.010609
