program: Gaussian 09
title: 000077590
version: EM64L-G09RevD.01
frameworkgroup: C1[X(C4H9ClO2)]
method: RPBEPBE
basis: SDD
operation: Freq
keyword: #p
keyword: freq=noraman
keyword: PBEPBE/SDD
title: #p freq=noraman PBEPBE/SDD
converged: NO NO NO NO
title: Mulliken charges:
elementType: Cl O O C C C C H H H H H H H H H
charge: -0.046358 -0.239347 -0.284725 -0.275689 -0.263601 -0.386209 -0.492174 0.214763 0.214586 0.208712 0.208311 0.247673 0.248990 0.235043 0.205034 0.204992
chargesum: 0.00000
title: Mulliken charges with hydrogens summed into heavy atoms:
elementType: Cl O O C C C C
charge: -0.046358 -0.239347 -0.284725 0.153661 0.153422 0.110454 0.152894
polarizability: 8.69145595e+01 -5.52726602e+00 5.12653347e+01 -1.63655949e-02 2.36052837e-02 4.38971543e+01
1716.lowfreq: -15.1317 -0.0036 -0.0034 -0.0023 6.0805 11.9432 43.2767 70.0879 89.2704
frequency: 8.8627 69.5402 89.2619 96.3502 111.0728 225.6831 227.3971 270.7411 424.2158 449.9482 729.6789 838.2143 874.7099 933.8054 956.8628 1037.4206 1069.7918 1098.0317 1101.5506 1122.3237 1162.2605 1163.8858 1177.6590 1257.4202 1301.1198 1339.3350 1397.2591 1439.8458 1457.2553 1459.4105 1471.8356 1487.2127 1495.1987 2922.6850 2942.1303 2950.6918 2974.2423 2987.6339 2996.7767 3020.9039 3049.4801 3103.8950
redmass: 4.8516 2.7392 4.8321 2.4369 2.4783 1.2227 4.8453 5.4465 4.5127 4.0999 5.6562 1.0942 7.1359 5.7733 1.3113 8.1896 5.7515 1.3306 3.2888 1.3081 1.1085 1.5286 1.1528 1.1461 1.1358 1.2627 1.4023 1.1576 1.0511 1.0919 1.0634 1.0717 1.0792 1.0352 1.0547 1.0538 1.0507 1.1053 1.1029 1.1106 1.1155 1.0974
irintensity: 0.1057 4.3464 4.0921 25.9459 0.0114 4.5523 1.2610 3.5639 1.9807 10.0666 68.7918 0.9521 37.6563 2.5312 0.0079 130.2683 257.1639 0.0870 15.6772 0.0160 0.3163 8.1567 11.4736 0.0598 35.9843 4.8572 4.4679 0.1399 12.8462 7.4143 12.1147 1.3678 7.0182 74.5015 32.4170 61.9766 69.4247 11.8913 71.0776 101.1192 44.2519 30.4352
temp: 298.150 k
press: 1.00000 atm
elementType: 17 8 8 6 6 6 6 1 1 1 1 1 1 1 1 1
symmnumber: 1
zpe: 336710.5 jmol-1
zpe.correction: 0.128246 hartree
zpe.thermalcorrener: 0.137642 hartree
zpe.thermalcorrenthalpy: 0.138586 hartree
zpe.thermalcorrgfe: 0.090766 hartree
zpe.sumelectzpe: -767.684657 hartree
zpe.sumelectthermal: -767.675261 hartree
zpe.sumelectthermalent: -767.674317 hartree
zpe.sumelectthermalfe: -767.722137 hartree
dipole: -2.3529 1.1174 -0.0128
dipole: 2.6047
quadrupole: -50.5477 -48.8204 -49.1549
quadrupole: 9.3282 -0.0139 0.0310
quadrupole: -1.0400 0.6873 0.3528 9.3282 -0.0139 0.0310
hfenergy: -767.8129029 hartree
pointgroup: C01 [X(C4H9Cl1O2)]
dipole: 0.9159945 0.4594816 0.0032636 debye
dipolederiv: -0.6073849 -0.135289 0.0021368 -0.2505701 -0.2598873 0.0020489 0.0039866 0.0017868 -0.1659816 -1.4156469 -0.037184 -0.0009389 0.1576365 -0.4098768 0.0009722 -0.0028856 -0.0019423 -0.4278716 -1.1350193 0.0741286 -0.0018265 0.0584228 -0.4180858 -0.0001012 -0.0019329 0.0008589 -0.4455857 0.6622455 0.1502672 0.0014035 0.3525485 0.3224222 -0.000993 0.0078415 0.0006203 0.4306512 0.6552737 0.1116112 0.0021325 0.1916281 0.2803102 0.0001032 0.0015432 -0.0005805 0.4371222 1.5278513 0.1468596 -0.0022453 -0.156672 0.5656473 -0.0033244 -0.0080381 -0.0028955 0.514419 0.6434121 -0.133588 0.0001633 -0.3226742 0.3245157 -0.001179 -0.0001006 -0.0009228 0.3782272 -0.0090851 -0.0025177 -0.0288175 -0.0652871 -0.0471109 0.1053591 0.0139871 0.1345876 -0.0953151 -0.0094078 -0.0005112 0.0308873 -0.0626451 -0.0409818 -0.1048383 -0.0136654 -0.1335618 -0.1016596 -0.0167184 -0.0039644 0.0233762 -0.0563919 -0.0447578 -0.107532 -0.024594 -0.1350547 -0.1094978 -0.0169194 -0.0031369 -0.0239193 -0.0563292 -0.0493285 0.108488 0.0234269 0.1362759 -0.1053026 -0.0819248 -0.0541283 -0.0175184 0.0343756 -0.0717207 -0.1014681 0.0517884 -0.1172381 -0.0871207 -0.0865818 -0.0518767 0.0148197 0.0340297 -0.0717657 0.1018783 -0.0521914 0.1181643 -0.0858273 -0.1177491 -0.0826574 -0.0010669 -0.1169498 0.0030409 -0.0009582 -0.0013938 -0.0008426 0.1149098 0.0036331 0.0117938 -0.0251321 0.1298265 -0.0400898 -0.1352835 0.0533676 -0.1427128 -0.1266651 0.0040217 0.0101933 0.0265453 0.1290518 -0.042331 0.136828 -0.0511395 0.1434572 -0.1245023 unknown
polarizability: 86.6596163|6.2906034|51.5200288|-0.0528063|-0.0494645|43.8974034 unknown
InChI: InChI=1S/C4H9ClO2/c1-6-2-3-7-4-5/h2-4H2,1H3
charge 0 multiplicity 1
16 atoms
Cl -3.838149 -0.556418 0.012517
O  -1.182217 -0.238474 -0.010869
O  2.426497 0.409533 0.005684
C  0.046561 0.580451 0.006017
C  1.211947 -0.40888 -0.001938
C  -2.365364 0.583712 -0.00162
C  3.642508 -0.401352 0.007107
H  0.097865 1.236985 -0.888332
H  0.08775 1.213357 0.917792
H  1.16464 -1.048431 -0.909753
H  1.164642 -1.064881 0.894084
H  -2.438556 1.203097 0.912937
H  -2.455152 1.200233 -0.916456
H  4.485689 0.307315 0.013365
H  3.704789 -1.043646 -0.898124
H  3.697451 -1.051101 0.90749
