program: Gaussian 09
title: 000077591
version: EM64L-G09RevD.01
frameworkgroup: C1[X(C7H6ClNO2)]
method: RPBEPBE
basis: SDD
operation: Freq
keyword: #p
keyword: freq=noraman
keyword: PBEPBE/SDD
title: #p freq=noraman PBEPBE/SDD
converged: NO NO NO NO
title: Mulliken charges:
elementType: Cl O O N C C C C C C C H H H H H H
charge: 0.042939 -0.210581 -0.179909 0.014804 0.554315 -0.460470 0.490852 -0.416688 -0.369829 -0.195199 -0.789066 0.246726 0.296083 0.244347 0.253500 0.253512 0.224663
chargesum: 0.00000
title: Mulliken charges with hydrogens summed into heavy atoms:
elementType: Cl O O N C C C C C C C
charge: 0.042939 -0.210581 -0.179909 0.014804 0.554315 -0.460470 0.490852 -0.169961 -0.073746 0.049148 -0.057391
polarizability: 1.29324013e+02 3.83567549e-01 1.28515318e+02 1.78172407e-03 -6.34102789e-03 4.25399109e+01
1716.lowfreq: -45.8359 -11.0096 -5.9964 -0.0028 -0.0020 0.0020 5.1275 79.4910 159.3620
frequency: -45.7842 79.4854 159.3609 200.3329 219.6468 245.0701 265.1020 327.4461 371.1480 452.2013 474.1642 498.8502 514.6068 571.6249 676.8704 695.1256 715.7862 764.5209 806.9411 875.3870 932.3505 997.2836 1002.9853 1029.5222 1050.4794 1105.4755 1156.5780 1181.8684 1191.5808 1258.4799 1369.2515 1371.9787 1404.2067 1412.8105 1452.7527 1459.4098 1474.8658 1582.2478 1595.5963 2990.7112 3071.2290 3101.6605 3140.6732 3165.7604 3189.5226
redmass: 15.2466 5.2287 1.0561 3.7651 12.2427 4.0150 5.3367 12.8934 5.3478 7.3011 4.6467 4.5977 3.5727 6.6705 5.9634 9.1209 3.3937 8.0298 1.4380 5.3911 1.3453 1.3434 1.7568 4.4501 1.5440 1.7163 2.2958 1.3483 10.5906 2.0369 10.3293 5.3187 1.2400 2.6050 3.1399 1.0446 1.1355 6.3003 6.8784 1.0369 1.0971 1.1003 1.0891 1.0933 1.0962
irintensity: 0.0269 0.2786 1.1374 0.7449 0.2195 2.9810 0.2020 1.2332 2.1847 4.2292 4.8494 0.1157 0.1213 6.6384 2.6745 16.4077 20.4840 21.3425 48.7934 12.2009 1.8245 1.2653 2.1324 52.0393 8.9820 3.7507 3.6058 18.5611 260.8264 0.9670 79.4534 1.5383 31.5100 25.6904 50.3563 16.0474 28.2219 19.4750 2.8615 13.8183 9.9363 14.6151 8.0283 10.4716 7.0826
temp: 298.150 k
press: 1.00000 atm
elementType: 17 8 8 7 6 6 6 6 6 6 6 1 1 1 1 1 1
symmnumber: 1
zpe: 308654.2 jmol-1
zpe.correction: 0.117560 hartree
zpe.thermalcorrener: 0.126592 hartree
zpe.thermalcorrenthalpy: 0.127536 hartree
zpe.thermalcorrgfe: 0.082935 hartree
zpe.sumelectzpe: -934.716826 hartree
zpe.sumelectthermal: -934.707794 hartree
zpe.sumelectthermalent: -934.706850 hartree
zpe.sumelectthermalfe: -934.751450 hartree
dipole: -5.3826 2.8153 -0.0038
dipole: 6.0744
quadrupole: -74.7183 -65.7457 -70.9773
quadrupole: 0.7575 -0.0168 0.0030
quadrupole: -4.2379 4.7348 -0.4969 0.7575 -0.0168 0.0030
hfenergy: -934.8343859 hartree
pointgroup: C01 [X(C7H6Cl1N1O2)]
dipole: -2.2689439 0.7505225 -0.0019906 debye
dipolederiv: -0.0382817 0.0512583 0.0000907 0.0081173 -0.6382862 -0.0004028 0.0000049 -0.0004076 -0.0059818 -0.7951593 -0.2386289 0.0000979 -0.1763531 -0.599946 0.0006626 -0.0013408 -0.0011272 -0.2323619 -0.5984527 0.1556864 -0.0001232 0.1597668 -0.6108517 -0.0006334 -0.0006468 0.0011363 -0.2036765 1.7347621 0.0839556 0.0007397 -0.1194454 1.0347628 -0.0002677 0.0009575 0.0001175 0.1898982 0.0796166 0.4135866 0.0001763 0.3772616 -0.1816547 -0.0001685 0.0000357 -0.0002519 0.0285791 0.1925807 -0.4088108 -0.0001882 0.113799 0.9061978 0.0008379 0.0003902 0.0004488 -0.0925599 -0.6795408 0.1038463 -0.0005593 0.1275359 -0.1242706 0.0000395 0.0003914 -0.0000104 0.1059873 0.1257855 0.0148952 -0.0000061 -0.1154163 0.0990019 0.0001445 -0.0000195 0.0000889 -0.141418 0.0623089 0.0270861 -0.0000986 -0.2475493 -0.1132772 -0.0001553 0.0003908 0.0000097 -0.1229165 -0.2300328 -0.1537522 -0.0001353 -0.0721053 0.1287567 0.0001416 -0.0000292 0.0002184 -0.1294029 0.0134146 -0.1175176 -0.000065 -0.1789022 -0.1003631 -0.0000151 -0.0001993 0.0000597 0.0357378 -0.0811635 0.0522544 0.0000336 0.0283308 0.0803665 -0.0000279 0.0001183 -0.0000397 0.1513609 0.105453 -0.0517259 0.000043 -0.0238788 0.0905586 -0.000021 -0.0000027 -0.0000776 0.1748297 0.0710566 0.0355963 -0.0000083 0.0413452 -0.0771353 -0.0000945 -0.0001165 -0.0001528 0.1608478 0.0629775 -0.0052886 0.040945 -0.0386282 0.0362286 -0.0904884 -0.0110627 -0.0925132 -0.0164941 0.0630134 -0.0051793 -0.0410493 -0.0385371 0.036025 0.0905523 0.0109721 0.0925485 -0.0161899 -0.0883381 0.0427383 0.0001071 0.1546591 0.0338871 -0.0001039 0.0001568 -0.0000474 0.1137606 unknown
polarizability: 129.1804075|0.4925632|128.6589039|0.0324084|0.0257003|42.5399301 unknown
InChI: InChI=1S/C7H6ClNO2/c1-5-3-2-4-6(7(5)8)9(10)11/h2-4H,1H3
charge 0 multiplicity 1
17 atoms
Cl -0.10893 -2.471586 -0.00184
O  2.903184 0.978021 0.001932
O  2.472046 -1.250882 0.001911
N  2.084148 -0.024973 -0.001067
C  -1.777586 -0.28272 -0.000805
C  -0.411526 -0.68327 -0.001053
C  0.622545 0.291699 -0.000819
C  -2.067222 1.103737 -0.000203
C  0.300238 1.6705 -0.000185
C  -1.043129 2.074884 0.000086
C  -2.901908 -1.297808 -0.000969
H  -3.117584 1.415283 0.000041
H  1.126825 2.384935 -0.000001
H  -1.292587 3.140086 0.00058
H  -2.847946 -1.956978 -0.886149
H  -2.847216 -1.958115 0.883302
H  -3.880552 -0.790513 -0.00026
