program: Gaussian 09
title: 000077617
version: EM64L-G09RevD.01
frameworkgroup: C1[X(C22H14O)]
method: RPBEPBE
basis: SDD
operation: Freq
keyword: #pfreq=noraman
keyword: PBEPBE/SDD
title: #p freq=noraman PBEPBE/SDD
converged: YES YES NO YES
title: Mulliken charges:
elementType: O C C C C C C C C C C C C C C C C C C C C C C H H H H H H H H H H H H H H
charge: -0.412294 0.231583 0.245407 0.553149 0.492902 0.234544 0.191119 -0.673900 -0.693689 0.345984 0.418400 -0.730888 -0.510032 0.035642 -0.482526 -0.385634 -0.367525 -0.367810 -0.435798 -0.262126 -0.280491 -0.260652 -0.250032 0.231165 0.237844 0.264275 0.240292 0.234277 0.230179 0.225475 0.185544 0.239328 0.231923 0.232971 0.227790 0.228952 0.354649
chargesum: 0.00000
title: Mulliken charges with hydrogens summed into heavy atoms:
elementType: O C C C C C C C C C C C C C C C C C C C C C C
charge: -0.057645 0.231583 0.245407 0.553149 0.492902 0.234544 0.191119 -0.442734 -0.455844 0.345984 0.418400 -0.466613 -0.269740 0.035642 -0.248248 -0.155454 -0.142050 -0.182266 -0.196470 -0.030204 -0.047520 -0.032862 -0.021080
polarizability: 5.27717079e+02 -1.26418864e+01 2.61292312e+02 1.02650221e-03 8.16918889e-03 8.92522399e+01
1716.lowfreq: -8.7794 -4.3092 -0.0010 -0.0005 -0.0003 8.0603 31.8260 53.7284 67.1205
frequency: 31.8148 53.7281 67.1192 114.4445 119.4484 142.0063 189.5315 208.9055 217.2560 220.5431 295.0215 308.4133 315.7585 353.5911 395.7790 420.5119 426.0737 439.9457 462.5354 473.4332 494.6938 514.6302 518.9411 545.2646 555.4115 562.0434 616.5404 617.1928 621.6209 680.3036 685.7833 717.5009 736.0086 742.3702 756.3048 760.6207 764.3385 796.6331 803.1515 824.0331 827.8117 861.4368 872.2884 876.4824 888.6854 913.9280 927.7594 941.0307 948.3005 957.0420 980.9489 985.1318 991.1973 1017.4676 1041.2743 1041.8808 1060.7590 1106.7573 1132.0916 1150.9272 1157.1337 1177.5929 1186.5118 1203.3718 1213.4196 1229.8498 1233.5242 1259.2526 1283.9623 1292.5052 1305.2390 1312.8318 1371.3263 1382.4704 1397.1560 1405.4635 1410.0506 1432.6738 1447.9275 1451.5640 1462.7609 1467.2093 1504.4922 1516.1063 1558.4238 1567.4421 1606.0257 1614.3708 1623.2169 1628.9342 1645.9010 3090.1790 3117.1200 3121.6782 3131.6994 3133.0131 3138.0786 3141.3195 3143.0863 3150.6577 3153.9683 3157.1458 3164.8183 3168.9418 3596.2106
redmass: 4.4313 4.8558 2.1983 3.7541 5.4659 4.2418 1.7949 6.1880 4.3552 4.5625 6.0981 3.8475 5.8049 4.3195 5.8178 2.9391 2.9747 3.2307 6.4051 6.5172 6.0008 2.9502 6.5245 3.4733 5.3112 3.1579 3.2566 6.6970 6.6144 6.0781 3.7018 6.3154 2.2440 5.5999 1.3256 1.6647 6.1796 1.6888 2.0509 4.8719 1.5162 1.4709 3.9358 1.8137 1.9064 1.6316 6.0134 1.5901 1.9719 1.4117 1.4099 1.3506 1.3740 4.6270 2.1523 3.6471 2.6785 2.1716 1.8013 1.4261 1.3470 1.0824 1.0948 1.4841 1.7251 2.0189 1.9046 1.9698 1.9308 1.4758 1.9667 2.5839 3.7743 4.8885 6.9615 3.5812 2.3042 2.7997 3.0387 4.1745 2.9958 2.9730 3.6381 3.8563 5.2811 7.4938 5.6290 6.0957 6.5803 6.8771 6.9709 1.0880 1.0859 1.0862 1.0888 1.0887 1.0885 1.0934 1.0965 1.0924 1.0921 1.0918 1.0998 1.0994 1.0655
irintensity: 0.8111 0.1102 26.4529 3.1613 0.5540 2.9357 66.4900 0.0076 7.5998 6.1061 4.9184 1.1609 0.7754 0.1196 7.0689 27.6833 1.2272 2.3523 0.3785 1.6753 0.5523 0.2185 1.9055 2.4882 23.0501 6.1696 1.8580 8.0230 2.7896 6.3654 15.1814 0.3326 14.9773 1.4662 5.5182 130.8143 2.6562 0.6927 0.9684 18.2894 39.1466 0.0025 7.7079 2.7610 0.4540 71.3995 3.6863 1.2778 11.0596 7.5994 0.0326 0.3924 0.0369 3.7639 6.7164 22.3601 28.2036 13.4435 135.7740 135.6460 1.3837 0.8596 10.7016 2.4200 3.5874 2.0496 34.2370 9.4144 2.5513 5.5733 6.0046 13.6391 66.5848 2.5198 8.0589 14.7319 10.7026 15.7440 6.6967 2.0259 11.2643 25.4168 15.0044 73.2290 2.3082 0.5772 0.1455 13.1649 8.9482 21.5944 73.4831 28.6884 0.4396 3.3913 10.6953 4.2313 3.7601 5.9400 30.1082 32.1518 21.7299 11.3567 46.5094 31.8878 54.1699
temp: 298.150 k
press: 1.00000 atm
elementType: 8 6 6 6 6 6 6 6 6 6 6 6 6 6 6 6 6 6 6 6 6 6 6 1 1 1 1 1 1 1 1 1 1 1 1 1 1
symmnumber: 1
zpe: 752744.6 jmol-1
zpe.correction: 0.286705 hartree
zpe.thermalcorrener: 0.303375 hartree
zpe.thermalcorrenthalpy: 0.304319 hartree
zpe.thermalcorrgfe: 0.242404 hartree
zpe.sumelectzpe: -920.495283 hartree
zpe.sumelectthermal: -920.478614 hartree
zpe.sumelectthermalent: -920.477670 hartree
zpe.sumelectthermalfe: -920.539584 hartree
dipole: 1.4787 -1.3467 0.0002
dipole: 2.0001
quadrupole: -99.8833 -119.7086 -142.6475
quadrupole: -2.9211 -0.0022 0.0033
quadrupole: 20.8631 1.0379 -21.9010 -2.9211 -0.0022 0.0033
hfenergy: -920.7819886 hartree
pointgroup: C01 [X(C22H14O1)]
dipole: -0.5871765 0.5238509 -0.0034233 debye
polarizability: 527.9391184|-9.9293554|261.0379197|-1.9005595|-1.9911749|89.2845928 unknown
InChI: InChI=1S/C22H14O/c23-22-13-16-12-20-15(10-9-14-5-1-2-6-17(14)20)11-21(16)18-7-3-4-8-19(18)22/h1-13,23H
charge 0 multiplicity 1
37 atoms
O  -3.8072 -3.049726 0.067138
C  -1.251109 0.385571 0.015585
C  1.603718 -0.121396 0.00841
C  -0.729864 -0.9678 0.029164
C  1.080798 1.232037 -0.005416
C  -2.705982 0.584945 0.020103
C  3.059775 -0.325122 0.004236
C  -0.319873 1.447751 -0.001446
C  0.672507 -1.183758 0.025289
C  -3.589179 -0.556281 0.037489
C  3.92982 0.824927 -0.013603
C  -1.639504 -2.084755 0.04638
C  1.996875 2.353041 -0.023193
C  -3.006623 -1.895003 0.050296
C  3.362524 2.158895 -0.027139
C  -3.296641 1.884073 0.007803
C  3.65996 -1.620064 0.017285
C  -5.002309 -0.351038 0.041799
C  5.345886 0.6413 -0.017773
C  -4.68696 2.06569 0.012202
C  -5.551242 0.938054 0.029392
C  5.053979 -1.780804 0.012939
C  5.907538 -0.642275 -0.004752
H  -0.66641 2.486632 -0.01233
H  1.020205 -2.22175 0.03599
H  -1.248831 -3.106934 0.05652
H  1.578712 3.366628 -0.033541
H  4.048001 3.014449 -0.040644
H  -2.654134 2.769224 -0.005487
H  3.029642 -2.514653 0.031102
H  -5.697574 -1.201741 0.055004
H  5.992185 1.527205 -0.031383
H  -5.106878 3.077007 0.002376
H  -6.63758 1.074786 0.03294
H  5.486635 -2.787186 0.023289
H  6.995246 -0.771735 -0.008085
H  -4.769913 -2.828094 0.068761
