program: Gaussian 09
title: 000077578
version: EM64L-G09RevD.01
frameworkgroup: C1[X(C6H6ClNO)]
method: RPBEPBE
basis: SDD
operation: Freq
keyword: #p
keyword: freq=noraman
keyword: PBEPBE/SDD
title: #p freq=noraman PBEPBE/SDD
converged: NO NO NO YES
title: Mulliken charges:
elementType: Cl O N C C C C C C H H H H H H
charge: -0.037103 -0.415059 -0.707438 0.541775 -0.426992 -0.413363 0.350769 -0.229191 -0.313469 0.245732 0.220140 0.215887 0.305750 0.308155 0.354406
chargesum: 0.00000
title: Mulliken charges with hydrogens summed into heavy atoms:
elementType: Cl O N C C C C C C
charge: -0.037103 -0.060654 -0.093533 0.541775 -0.181259 -0.193223 0.350769 -0.229191 -0.097582
polarizability: 1.21334331e+02 1.64336655e+00 9.68974869e+01 -1.64413247e-03 -1.76260803e-03 3.39542775e+01
1716.lowfreq: -9.8751 -4.8320 -0.0018 0.0010 0.0028 9.0326 131.2499 177.2755 208.1220
frequency: 131.2492 177.2746 208.1202 289.4801 293.3232 315.4697 328.8333 347.0005 392.4704 434.0410 465.8587 490.4967 580.8816 677.1388 698.2001 755.3871 783.6941 848.8676 884.8965 898.8044 1018.3454 1029.5728 1120.5642 1161.5054 1244.8911 1271.1339 1326.1794 1390.3965 1433.7292 1510.6171 1583.4494 1635.9126 1648.4780 3112.0079 3143.0750 3149.6610 3574.1263 3583.8527 3714.2768
redmass: 5.5746 4.8022 9.1768 1.1187 4.7298 1.1566 1.1018 6.4031 5.4479 2.7747 7.4180 3.9738 3.4034 7.2072 3.2045 6.1431 1.4739 1.6394 5.7587 1.3550 3.0131 1.4775 1.4098 1.1570 1.8643 1.6146 2.9313 5.7314 3.8411 3.4287 6.7502 1.5933 2.6226 1.0879 1.0951 1.0928 1.0450 1.0660 1.1042
irintensity: 0.0272 12.6632 0.5101 101.5673 9.5274 231.9247 112.1868 19.5212 0.1156 14.6543 2.4777 10.3718 11.9116 6.2986 0.4194 52.8876 49.0247 41.9721 26.0865 0.0227 28.5788 12.5293 166.3479 67.3337 29.9899 33.7232 21.4682 46.4133 11.3279 226.3397 36.9033 20.8714 185.7309 17.9158 17.3536 5.9681 75.4665 29.6011 21.6301
temp: 298.150 k
press: 1.00000 atm
elementType: 17 8 7 6 6 6 6 6 6 1 1 1 1 1 1
symmnumber: 1
zpe: 285029.8 jmol-1
zpe.correction: 0.108562 hartree
zpe.thermalcorrener: 0.117239 hartree
zpe.thermalcorrenthalpy: 0.118183 hartree
zpe.thermalcorrgfe: 0.075298 hartree
zpe.sumelectzpe: -821.609490 hartree
zpe.sumelectthermal: -821.600813 hartree
zpe.sumelectthermalent: -821.599869 hartree
zpe.sumelectthermalfe: -821.642755 hartree
dipole: -4.4552 1.3609 0.0011
dipole: 4.6584
quadrupole: -52.1892 -45.0814 -64.1723
quadrupole: 6.0273 -0.0039 -0.0018
quadrupole: 1.6251 8.7329 -10.3580 6.0273 -0.0039 -0.0018
hfenergy: -821.7180522 hartree
pointgroup: C01 [X(C6H6Cl1N1O1)]
dipole: -1.6122308 0.8716346 0.0004198 debye
dipolederiv: -0.4410239 0.2920584 0.0000053 0.376453 -0.4126579 -0.0000028 0.0000009 0.0000026 -0.0584275 -1.2615653 -0.5046097 0.0000235 -0.45071 -0.1814696 0.0000233 0.0000453 0.0000292 -0.3970215 -1.4477392 -0.3838407 -0.0001236 -0.4195342 -0.2193145 -0.0000489 -0.0004135 -0.0001314 -0.7738216 1.4720654 0.4591648 0.0000451 0.5037371 0.0353488 0.0000175 0.0000312 0.0000207 0.1423525 -0.4374303 -0.215969 0.0000071 0.3262814 -0.0482829 -0.0000087 0.0000077 0.0000152 -0.1913247 -0.24581 0.1470168 -0.0000025 -0.4742584 0.0238416 -0.0000034 0.0000358 -0.0000291 -0.2349049 0.8766641 0.6425347 -0.0000381 0.5734487 -0.1679783 -0.0000154 -0.0000397 -0.0000165 0.0200628 0.6092384 -0.2470026 -0.000008 -0.7093324 0.7171266 0.0000038 -0.0000066 -0.0000101 -0.049107 0.0678442 -0.3595211 0.0000078 0.1582904 0.0867917 -0.0000126 -0.0000103 -0.000003 -0.1562854 0.0654026 -0.0493702 0.0000023 -0.0475722 -0.0507423 0.0000109 0.0000036 0.0000019 0.1757956 -0.0632277 0.1065763 0.0000021 0.0930322 0.0002941 0.0000003 -0.0000022 0.0000082 0.1752291 0.041002 -0.073554 0.0000066 -0.0589184 -0.1095113 0.0000117 0.0000069 0.0000133 0.1686607 0.2101433 0.0168395 0.000045 -0.001656 0.1126327 -0.0000191 0.0001947 -0.0000103 0.3951034 0.1897109 0.0315781 0.0000241 0.0554271 0.1354246 0.0000502 0.0001532 0.0001212 0.3968533 0.3647254 0.1380987 0.0000033 0.0753116 0.0784968 -0.0000068 -0.000007 -0.0000119 0.3868353 unknown
polarizability: 121.0152063|-3.2244702|97.2166114|-0.0019604|-0.0014025|33.9542775 unknown
InChI: InChI=1S/C6H6ClNO/c7-5-3-4(8)1-2-6(5)9/h1-3,9H,8H2
charge 0 multiplicity 1
15 atoms
Cl 2.079815 -1.940418 -0.000034
O  2.467878 1.030305 -0.000121
N  -2.968909 -0.588518 -0.000002
C  -1.634783 -0.168559 0.000021
C  -0.576291 -1.121618 0.000023
C  -1.298171 1.21471 -0.000025
C  1.104824 0.678881 -0.000074
C  0.76132 -0.693186 -0.000028
C  0.050409 1.622653 -0.000077
H  -0.793764 -2.194973 0.000047
H  -2.092004 1.970278 -0.000043
H  0.289903 2.694333 -0.000124
H  -3.726106 0.087412 0.000256
H  -3.205325 -1.57559 0.000285
H  2.566704 2.01469 -0.000103
